Error 1939. The service ‘My_Service’ could not be configured

Problem: MSI 5.0 package fails with an ERROR 1939 during “MsiConfigureServices” standard action execution. I tried to use “MsiConfigureServices” standard action in the msi package to configure a custom service. The MSI package fails to execute on Win 7 + OSs. The exact same issue can be found at this forum discussion As per the…

1

A device attached to the system is not functioning

ClickOnce application may fail with the following error message: A device attached to the system is not functioning. (Exception from HRESULT: 0x8007001F) As per the ClickOnce log:                                  + Exception reading manifest from file:///C:/TEMP/Application%20Files/app_1_0_0_1/app.exe.manifest: the manifest may not be valid or the file could not be opened.                                 + Parsing and DOM creation of the…

1

Error 25003. Error occurred while initializing fusion

The Microsoft .Net Framework 4.0 Setup may fail without any error message or the setup may crash during the install phase. You can find the below error message in the Setup log file (Microsoft .NET Framework 4 Setup_******_******-MSI_netfx_Core_*.msi.txt) under user temp folder(%temp%): MSI (s) (18:60) [15:39:53:968]: Executing op: CustomActionSchedule(Action=CA_InstallAssemblyDef.3643236F_FC70_11D3_A536_0090278A1BB8,ActionType=1025,Source=BinaryData,Target=InstallAssembly,CustomActionData=C:\WINDOWS\Microsoft.NET\Framework\v4.0.30319\;C:\WINDOWS\Microsoft.NET\Framework\v4.0.30319\ISymWrapper.dll;78168) MSI (s) (18:00) [15:39:54:031]: Invoking remote…

0

Visual Studio 2012 fails with an error ‘The pipe is being closed’

The Microsoft Visual Studio 2012 OR Visual Studio 2012 Update 3 install may fail with the below error message:      After reviewing the Setup failure log dd_vs_****_201308291*****.log, I found the below failure message:    [0690:23A4][2013-07-29T17:00:28]: MUX:  Source confirmed [0690:23A4][2013-07-29T17:00:28]: Acquiring package: webdeploy_x86_en_usmsi_901, payload: webdeploy_x86_en_usmsi_901, copy from: C:\VS2012_ISO\packages\WebDeploy\WebDeploy_x86.msi [0690:23A4][2013-07-29T17:00:29]: Error 0xc000000d: Failed to get signer chain…

1

Visual Studio IDE may crash without any error message

While launching Visual Studio 2012/2010 IDE, Visual Studio IDE may crash without any error message. I launched the devenv.exe in the debugger and took a crash dump. You can also run the following command to capture a crash dump: cscript adplus.vbs -crash –sc "C:\Program Files (x86)\Microsoft Visual Studio 10.0\Common7\IDE\devenv.exe" After debugging I found the below…

0

DDSet_Error: CacheGACAssembly failed

The Microsoft .Net Framework 4.0 update KB2468871 may fail without any error message or the setup may crash almost at the end. You can find the below error messages in the log file (KB2468871v2_***_***-Microsoft .NET Framework 4 Client Profile): 08/07/13 11:57:37 DDSet_Entry: CacheGACAssembly started – Caching GAC Assemblies 08/07/13 11:57:37 DDSet_Status: CustomActionData: C:\Windows\Microsoft.NET\Framework64\v4.0.30319\;C:\Windows\Microsoft.NET\Framework\v4.0.30319\GAC26267;C:\Windows\Microsoft.NET\Framework\v4.0.30319\System.Xml.Serialization.dll 08/07/13 11:57:37…

0

An error occurred creating the configuration section handler for userSettings/Microsoft.SqlServer.Configuration.LandingPage.Properties.Settings

You may receive the below error message while installing Microsoft® SQL Server® 2008 R2 Setup System.Configuration.ConfigurationErrorsException: An error occurred creating the configuration section handler for userSettings/Microsoft.SqlServer.Configuration.LandingPage.Properties.Settings: Could not load file or assembly ‘System, Version=4.0.0.0, Culture=neutral, PublicKeyToken=b77a5c561934e089’ or one of its dependencies. The system cannot find the file specified. As per the fusion log: The operation…

25

The mounted file system does not support extended attributes

The Microsoft .Net Framework 3.5 SP1 /2.0 SP2 Setup may fail without any error message or the setup may crash almost at the end. You can find the below error messages in the log file:   MSI (s) (00:C8) [10:09:41:999]: Executing op: CustomActionSchedule(Action=CA_InstallAssemblyDef.3643236F_FC70_11D3_A536_0090278A1BB8,ActionType=1025,Source=BinaryData,Target=InstallAssembly,CustomActionData=c:\WINDOWS\Microsoft.NET\Framework\v2.0.50727\IEExecRemote.dll;8192) MSI (s) (00:DC) [10:09:42:092]: Invoking remote custom action. DLL: C:\WINDOWS\Installer\MSI20D.tmp, Entrypoint: InstallAssembly…

0

Install cannot continue because some required components failed

Microsoft Visual Studio 2012 Setup may fail on Windows 7 system with the below error screenshot: As per the Setup failure log (dd_vs_***_58*****875_vs_professionalcore.log): MSI (s) (A4:48) [18:08:37:579]: Executing op: CustomActionSchedule(Action=RollbackHttp.992B75DB_179A_4B48_B260_9FD0862C9A76,ActionType=3329,Source=BinaryData,Target=Uninstall,) MSI (s) (A4:48) [18:08:37:580]: Executing op: ActionStart(Name=ReserveHttp.992B75DB_179A_4B48_B260_9FD0862C9A76,,) MSI (s) (A4:48) [18:08:37:581]: Executing op: CustomActionSchedule(Action=ReserveHttp.992B75DB_179A_4B48_B260_9FD0862C9A76,ActionType=3073,Source=BinaryData,Target=Install,) MSI (s) (A4:A8) [18:08:37:605]: Invoking remote custom action. DLL: C:\Windows\Installer\MSIA1BF.tmp, Entrypoint:…

0

MSBUILD : error MSB1003: Specify a project or solution file. The current working directory does not contain a project or solution file.

You may find the below error message while trying to create or build a VC++ (Win32/MFC/ATL) project in Microsoft Visual Studio 2012: MSBUILD : error MSB1003: Specify a project or solution file. The current working directory does not contain a project or solution file. Please check the following reg keys (I printed what should be…

0