Troubleshooting 1935 and 2908 errors during installation


Hey all, first off I want to apologize for not posting anything in a couple of weeks.  I have had a couple of mini-vacations and been wrapped up with some other stuff, but I’m back now!  I’ve been working with some Product Support folks I know to turn some documents I wrote for internal troubleshooting into knowledge base articles, and I decided that I wanted to go ahead and post some of the information here so it would be available sooner rather than later.  The first installment is some detailed information about the dreaded 1935 (or 2908) error that sometimes happens when trying to install the .NET Framework or other MSI-based products that install managed assemblies to the GAC.  This is a long post, but hopefully with some useful info.  Let me know if you see any scenarios not covered by this information or have any questions….


 


1935 Errors in Setup


 


Abstract


 


The following document describes causes of 1935 errors during .NET Framework, J# redistributable package, language pack, or Visual Studio setup.  It also explains how to diagnose the root cause of a 1935 error and workaround or fix the error.


 


Introduction


 


A 1935 error is one of the most common problems that can prevent a user from being able to install the .NET Framework, J# redistributable package, Visual Studio or any other application that uses the Windows Installer MSIAssembly and MSIAssemblyName tables to install assemblies.


 


In general, this error means that Windows Installer encountered an error while trying to install assemblies to the Global Assembly Cache (GAC) or the Win32 GAC (WinSxS).  This error is considered fatal and causes setup to fail and initiate rollback.


 


If the setup is run in UI mode, the user will see a message box indicating that a 1935 error occurred, and it will list the HRESULT and the Windows Installer component GUID of the assembly that caused the error.  If the setup is run in silent mode, the user will see no visible error.  In both cases, more detailed information about the error can be found in the Windows Installer verbose log file.


 


Affected Products


 


·         .NET Framework 1.0


·         .NET Framework 1.1


·         .NET Framework 1.1 language packs


·         Visual J# .NET redistributable 1.1


·         Visual J# .NET redistributable 1.1 language packs


·         Visual Studio .NET 2002 (all versions)


·         Visual Studio .NET 2003 (all versions)


 


Finding log information for 1935 errors that occur during setup


 


Where to find the log files


 


In order to diagnose the cause of a 1935 error, it is first necessary to locate information in the Windows Installer verbose log.  If the error occurred during Visual Studio setup or during the .NET Framework or J# redistributable setups that are run as a part of Visual Studio Prerequisites (or Windows Component Update) setup, verbose logging is enabled by default.  The log files vsmsilog*.txt, netfx.log, or jsredistmsi.log in %temp% will provide the necessary information, depending on which product’s setup failed.


 


If the error occurs during standalone setup for the .NET Framework, .NET Framework SDK or J# redistributable package setup, it will be necessary to rerun the failing setup with an extra command line parameter to enable Windows Installer verbose logging in order to produce a log file with the necessary information to debug the failure.  To enable verbose logging, rerun the setup with the following command line syntax:


 





























Product


Command line syntax


Log file location


.NET Framework


dotnetfx.exe /c:”install.exe /l”


%temp%\netfx.log


.NET Framework SDK


setup.exe /c:”install.exe /l”


%temp%\netfxsdk.log


.NET Framework Language Pack


langpack.exe /c:”inst.exe /l”


%temp%\langpackmsi.log


J# Redistributable Package


vjredist.exe /c:”inst.exe /l”


%temp%\jsredistmsi.log


J# Redistributable Package Language Pack


Vjredist-LP.exe /c:”inst.exe /l”


%temp%\langpackmsi.log


 


Note: The log file location can be controlled by passing a full path after the /l switch to install.exe or inst.exe.  The locations listed in the table are the default locations if no path is provided.


 


Where to find error information in the log file


 


To pinpoint the cause of a 1935 error, search for the string return value 3 in a verbose Windows Installer log file.  This will show the exact point in which setup failed and initiated a rollback.  The following is an example of the information written to a Windows Installer verbose log file in the case of a 1935 error:


 


Error 1935.An error occured during the installation of assembly component {7D4B5591-4C80-42BB-B0E5-F2C0CEE02C1A}. HRESULT: -2146234301. assembly interface: IAssemblyCacheItem, function: Commit, assembly name: Microsoft.Vsa.Vb.CodeDOMProcessor,Version=”7.0.5000.0″, PublicKeyToken=”b03f5f7f11d50a3a”, Culture=”neutral”,FileVersion=”7.10.3052.4″, ProcessorArchitecture=”neutral”


 


In this example, the assembly named Microsoft.Vsa.Vb.CodeDOMProcessor.dll failed to install properly due to an error with HRESULT value -2146234301.


 


List of causes of 1935 errors and their HRESULT values


 


There are many different underlying causes of a 1935 error, each represented by a different HRESULT.  Once you locate the information in the Windows Installer verbose log file indicating which assembly is causing the error and what the HRESULT of the error is, you can use the table below to determine more specific information about the cause:


 





















































































 


Return type


 


 


Return code


 


HRESULT


 


Description of error


TYPE_E_DLLFUNCTIONNOTFOUND


0x8002802F


-2147319761


Function not defined in specified DLL


ERROR_ACCESS_DENIED


0x7FF8FFFB


-2147024891


Access is denied


COR_E_MODULE_HASH_CHECK_FAILED


0x80131039


-2146234311


The check of the module’s hash failed


FUSION_E_REF_DEF_MISMATCH


0x80131040


-2146234304


The located assembly’s manifest definition does not match the assembly reference


FUSION_E_INVALID_PRIVATE_ASM_LOCATION


0x80131041


-2146234303


The private assembly was located outside the app-base directory


FUSION_E_ASM_MODULE_MISSING


0x80131042


-2146234302


A module specified in the manifest was not found


FUSION_E_UNEXPECTED_MODULE_FOUND


0x80131043


-2146234301


Modules which are not in the manifest were streamed in


FUSION_E_PRIVATE_ASM_DISALLOWED


0x80131044


-2146234300


A strongly-named assembly is required


FUSION_E_SIGNATURE_CHECK_FAILED


0x80131045


-2146234299


The check of the signature failed


FUSION_E_DATABASE_ERROR


0x80131046


-2146234298


An unexpected error was encountered in the Assembly Cache database


FUSION_E_INVALID_NAME


0x80131047


-2146234297


The given assembly name or code-base is invalid


FUSION_E_CODE_DOWNLOAD_DISABLED


0x80131048


-2146234296


HTTP download of assemblies has been disabled for this app-domain


FUSION_E_UNINSTALL_DISALLOWED


 


0x80131049


-2146234295


Uninstall of given assembly is not allowed


FUSION_E_NGEN_DEPENDENCY_NOT_FOUND


0x80131050


-2146234288


One of the native image dependencies cannot be found


FUSION_E_NGEN_INDEX_CORRUPTED


0x80131051


-2146234287


ngen index corrupted


 


NOTE: The Windows Installer team created separate error codes for 3 of the above return types starting with the version that shipped with Windows Server 2003.  The following are the new error codes and the return types they correspond to in Windows Server 2003 and in versions of Windows Installer greater than 2.0 (all other return types from the above table continue to be represented by error code 1935):


 

















Error code


Return Type


1936


FUSION_E_PRIVATE_ASM_DISALLOWED


1937


FUSION_E_SIGNATURE_CHECK_FAILED


1938


FUSION_E_ASM_MODULE_MISSING


 


 


Resolving 1935 errors that occur during setup


 


Most of the above HRESULT values in the table of 1935 errors above indicate some kind of setup authoring problem, and they require that the MSI package or some of the files in the package be patched and repackaged.  All return types that begin with FUSION fit into this category.


 


1935 errors with HRESULT -2147319761 (function not defined in specified dll)


 


The most common source of a 1935 error is HRESULT -2147319761 (which means that a function is not defined in specified DLL).  This error is typically caused by a mismatch or incompatibility between the version of mscoree.dll in the Windows system directory and the version needed by the product being installed.  Often this can occur if a user has a previous beta version or technology preview build of the .NET Framework installed on their machine (even if they then uninstall it).


 


There are several possible ways to workaround this type of 1935 error.  The workarounds depend on the product being installed and the OS that the product is being installed on.  Refer to the sections below for more details for the individual products.


 


.NET Framework


 


This workaround applies to all versions of the .NET Framework. 


 


The following steps will fix most cases of a 1935 error with HRESULT -2147319761 on operating systems that do not contain the .NET Framework as part of the operating system (applies to Windows 98, Windows Me, Windows NT 4, Windows 2000, and Windows XP except as noted below):


 



  1. Rename the file %windir%\system32\mscoree.dll (or %windir%\system\mscoree.dll on Windows 98 and Windows Me).  Also, please take note of what the version of this file is to aid in tracking down why this error is occurring.
  2. Delete the folder %windir%\system32\urttemp (or %windir%\system\urttemp on Windows 98 and Windows Me) if it exists.
  3. Re-run the .NET Framework setup that failed originally.

 


Because the .NET Framework ships as part of the OS for Windows XP Tablet PC Edition, Windows XP Media Center Edition and Windows Server 2003, it is dangerous to delete mscoree.dll from the system directory because it can affect OS functionality.  In some cases, it is impossible to delete this file because it is under system file protection.  The following steps will fix most cases of a 1935 error with HRESULT -2147319761 on these OS types:


 



  1. Rename the file %windir%\system32\mscoree.dll.  Also, please take note of what the version of this file is to aid in tracking down why this error is occurring.
  2. Extract the file mscoree.dll from netfx.cab in the i386 directory of your original OS installation media or network path.
  3. Copy mscoree.dll from netfx.cab to %windir%\system32.
  4. Re-run the .NET Framework setup that failed originally.

 


NOTE: This error should not ever be seen for .NET Framework v1.1 on Windows Server 2003 because .NET Framework v1.1 shipped as part of the operating system, and the Windows Installer package for this version should block if a user attempts to install it on this OS.  This error should also not ever be seen for .NET Framework v1.0 on Windows XP Tablet PC or Media Center editions because .NET Framework v1.0 shipped as part of the OS.


 


J# Redistributable Package, Language Packs, and Visual Studio


 


In most cases, a 1935 error with HRESULT -2147319761 during installation of the J# redistributable package, .NET Framework or J# redistributable package languages packs, or Visual Studio will require a repair of the highest version of the .NET Framework currently installed on the machine.


 


If you have the .NET Framework installed via a Windows Installer MSI package, you can perform the following steps to repair the .NET Framework:


 



  1. Rename the file %windir%\system32\mscoree.dll (or %windir%\system\mscoree.dll on Windows 98 and Windows Me).  Also, please take note of what the version of this file is to aid in tracking down why this error is occurring.
  2. Delete the folder %windir%\system32\urttemp (or %windir%\system\urttemp on Windows 98 and Windows ME) if it exists.
  3. If you are trying to repair the .NET Framework v1.0, locate the file repair.htm in the folder %windir%\Microsoft.NET\Framework\v1.0.3705 and follow the instructions on that page.
  4. If you are trying to repair the .NET Framework v1.1, locate the file repairRedist.htm in the folder %windir%\Microsoft.NET\Framework\v1.1.4322\1033 and follow the instructions on that page.
  5. Rerun the setup that failed originally.

 


If you have the .NET Framework installed as part of the operating system and find that it needs to be repaired, you should first try the following steps:


 



  1. Rename the file %windir%\system32\mscoree.dll.  Also, please take note of what the version of this file is to aid in tracking down why this error is occurring.
  2. Extract the file mscoree.dll from netfx.cab in the i386 directory of your original OS installation media or network path.
  3. Copy mscoree.dll from netfx.cab to %windir%\system32.
  4. Re-run the setup that failed originally.

 


If these steps fail, you may need to rerun OS setup to trigger a repair of the entire .NET Framework.


 


What to do if the above troubleshooting steps do not work


 


In some cases, the 1935 error with HRESULT -2147319761 can be caused by orphaned registry keys from a different version of the .NET Framework, and replacing mscoree.dll or repairing the .NET Framework will not fix the error.  In these cases, try to look in the registry key HKLM\Software\Microsoft\.NETFramework and look for any sub-keys or values containing version numbers of previous builds of the .NET Framework.  If any are present, rename or delete them, then try to rerun the previously failing setup.


 


In addition if you are trying to install the .NET Framework v1.0, delete the following registry keys and any sub-keys and values, if present:


 


·         HKLM\Software\Microsoft\NET Framework Setup\Full


·         HKLM\Software\Microsoft\NET Framework Setup\Product


 


 


NOTE:  Be very careful when directly modifying the registry in this way, particularly on operating systems where the .NET Framework ships as part of the OS.  It is always recommended to backup your registry prior to making direct modifications to it so that you can roll back to a known state.


 


If there are no orphaned registry keys or deleting orphaned keys did not fix the problem, it may be necessary to completely uninstall and reinstall the highest version of the .NET Framework on the machine.  This can be done by locating the entry in the Add/Remove Programs control panel applet and choosing to uninstall, then reinstalling from the original source.


 


If uninstalling and reinstalling also does not work, it may be necessary to perform a manual removal of the highest version of the .NET Framework on the machine.


 


NOTE: Manual removal is not recommended and can be very dangerous if the .NET Framework shipped as part of the operating system.  In these cases, it is recommended to repair the OS by rerunning OS setup.


 


Additional Information


 


·         http://support.microsoft.com/default.aspx?scid=kb;en-us;308096


·         http://support.microsoft.com/default.aspx?scid=kb;en-us;824643


·         http://support.microsoft.com/default.aspx?scid=kb;en-us;830646


·         http://support.microsoft.com/default.aspx?scid=kb;en-us;839547


·         http://support.microsoft.com/default.aspx?scid=kb;en-us;872904  


 

Comments (192)

  1. Anonymous says:

    Oh my GOD!!!!!!!! You are the biggest genius in the world. I’ve been trying to fix my stupid .NET for weeks. Thank you, thank you, Thank You. Cheers.

  2. Anonymous says:

    Thank you very much indeed! It is so nice to find a proffesional and responsible solution. I have been working for days trying to resolve this prolem. Have gone down many blind alleys and encountered many people with the same problem but nobody had any real solutions.

    Thank you again. I sincerely appreciate your efforts and generosity.

  3. Anonymous says:

    Any help with –

    Error 1935. An error occurred during the installation of assembly ‘Autodesk.AECC.Interop.Pipe,Version="300.0.0.0",PublicKeyToken="B74B3593C4D6567F",GUID="e8300000-b0c5-4186-8df9-3d5372b7dc57",LCID="1033"’. Please refer to Help and Support for more information. HRESULT: 0x80131047. assembly interface: , function: CreateAssemblyNameObject, component: {7888F088-71DA-4F7A-8716-15306515AA3B}

    MSI (s) (30:5C) [12:51:02:055]: Product: Autodesk Civil 3D 2006 — Error 1935. An error occurred during the installation of assembly ‘Autodesk.AECC.Interop.Pipe,Version="300.0.0.0",PublicKeyToken="B74B3593C4D6567F",GUID="e8300000-b0c5-4186-8df9-3d5372b7dc57",LCID="1033"’. Please refer to Help and Support for more information. HRESULT: 0x80131047. assembly interface: , function: CreateAssemblyNameObject, component: {7888F088-71DA-4F7A-8716-15306515AA3B}

  4. Hi Matthew – Can you please try the steps listed at http://blogs.msdn.com/astebner/archive/2005/03/29/403575.aspx and send me the log file that is produced? Unfortunately, the log file snippet you posted does not contain enough information to determine the root cause, but the steps at my other blog post should create a verbose log that will help us figure this out.

  5. Anonymous says:

    I have heard from a few people (including this customer comment on a previous blog post and a fellow…

  6. Anonymous says:

    error 1935 microsoft.msxml2,publickeytoken="6bd6b9abf345378f,version="4.1.0.0",type="win32",processorArchitecture="x86"

  7. Hi John – can you please try to use the steps listed at http://blogs.msdn.com/astebner/archive/2005/03/29/403575.aspx to gather a verbose log of this setup failure. The snippet of the error message that you list is not enough to allow us to figure out the root cause. If you can gather the logs go ahead and send them to me at aaronste (at) microsoft (dot) com and I can take a look.

  8. Anonymous says:

    ‘SoapSudsCode,Version="1.0.5000.0",PublicKeyToken="b03f5f7f11d50a3a",Culture="neutral",FileVersion="1.1.4322.573"’ HRESULT 0x80070003. This HRESULT isnt mentioned in your post. I am currently doing another (going to fail) setup with the verbose mode as you mentioned in the other post. Meanwhile you could perhaps look into this thing and deduce what might be the problem here.

    Thanks in advance

  9. Hi uXuf – the HRESULT value 0x80070003 means "the system cannot find the path specified". In many cases I have seen errors with this HRESULT have the same root causes as errors with HRESULT 0x80070002 ("the system cannot find the file specified"). So can you please try to use the troubleshooting steps at http://blogs.msdn.com/astebner/archive/2005/02/01/364375.aspx and see if they help you get past this error? If not, please contact me at aaronste (at) microsoft (dot) com and send your verbose logs and we can dig into it more deeply.

    Hope this helps…

  10. Anonymous says:

    Ever since I published my blog post describing 1935 errors in more detail, I have been contacted by customers…

  11. Anonymous says:

    Evidently my system is not infected by that thing. So there is nothing to remove. I had run a complete spyware scan by Spyware Doctor (3.0 I think) some time ago, and it had weeded out a couple of nasty things. But it isnt the case now. I am sending the logs at your email. I would appreciate a quick reply 🙂

  12. Anonymous says:

    ok , this all looks really helpful and im 100% ( i hope ) sure it can help me out ! the thing is thought ….. im having difficulty understanding certain things – ( alot of it )

    this is my problem …

    i have purchased a sony ericsson k750I mobile that come with a pc suite that allows you to connect your phone to your computer. the cd gets installed by 99% then an error message appears !! ERROR 1935 ) MY worst enemy !! ive tried alot of things to get the problem sorted – updating everything , trying to re – install net.framework thinking that mite help . cant even remeber if the downloaded was completed . anyway this is a really big problem – this is the exact message i recive – is there anyway you could write me a simple solution that can help ?? pleazzzzzzzzzzzz

    ( this is the message here ) or sumthin similar

    error 1935 an error occurred during the installation ……..

    publickeytoken ( then numbers ) or numbers sumthin about microsoft.msmxl or sumthin like that then it mentions win32 for more help seek support – anyway it should shound familar ive seen this thing all over the net trying to look for a solution cna u help me ???

    write bac pleaz

  13. Hi Trevor – can you please use the steps listed at http://blogs.msdn.com/astebner/archive/2005/03/29/403575.aspx to gather the verbose setup log file and then send it to me at aaronste (at) microsoft (dot) com and I will take a look and see if I can figure out how to fix this issue on your computer?

  14. Anonymous says:

    I was contacted by a customer this week who could not install the .NET Framework 1.1 due to a 1935 error…

  15. Anonymous says:

    I was contacted by a customer this week who could not install the .NET Framework 1.1 due to a 1935 error…

  16. Anonymous says:

    We have seen this problem so much, that we have been working with Microsoft to fix these problems.

    If the suggestions above don’t cure it, the following will…

    – Disconnect your computer from the internet

    – Reboot

    – Stop any applicaton that will affect drive performance. (This means… stop anti-virus, anti-spyware, disk watcher utilities, etc).

    – I have also found it helpful to stop other unnecessary tray applications (like weatherbug, quicktime, monitor apps, etc)

    – rerun the install that failed previously

    This almost always cures the problem.

    One last resort is to copy the entire CD to a new folder on your desktop and run the installation from there. Be careful of this, as it sometimes doesn’t work (because installations are not always written well).

    Good luck everyone!

  17. Anonymous says:

    Hey,

    I was having trouble installing a sitebuilder because of that 1935 error. I am a total novice at the computer and I probably shouldn’t have been messing around with technical stuff. I have to admit though I followed what you said to the T and works like a champ. Genius you are I tell you. Thanks for that advice. Save me probably huge dollars taking it downtown.

    Darrell

  18. Anonymous says:

    Thanks for making this available, I found it very usefull in trying to track down a recent installation failure in Visual Studio 2003 after my registry got corrupted.

    Using your info I could get .NET to install, but Visual J# kept giving me a long line of 2908 errors which could not be handled with your suggested way to handle them.

    I tried to enable the extended logging in J# installation but both the version on my VS DVD and the one I could download from MS would not recognize the command line parameters you specified.

    After setting up logging via the registry I noticed that the error was related to MSCOREE.DLL, but neither of the versions I had would work. So in the end I went and installed the .NET 2.0 package which has a later version of the DLL in it and lo and behold it worked, J# installed and then VS 2003 would install as well.

    This should work if you get 2908 errors for any of the following:

    5D4D23A8-6765-4220-B16F-E44C2B31B128

    18A1AE0D-F3EA-4233-95EC-2EF8E30F65EE

    CFC5CCA1-1B50-4781-A61B-C8797D25BD10

    866F913F-5BA2-42A7-893B-15662FDDD38F

    AE05F957-0FD1-4511-B3B4-AA3C06EF3961

    EAC4D483-FF3D-4029-9BF6-1920BDBAB5BC

    6591CEAF-05A6-4799-9FFE-38ACC9259BD0

    6810C11E-3775-4EE5-BB23-25D8F115F285

    If you’re ever in Copenhagen I’ll buy you a beer 🙂

  19. Anonymous says:

    Thanks a lot for this perfect article – this helped me solving my installation problem with Visual Studio 2003 and .NET Framwork.

    … and I will pay the second beer 🙂

  20. Anonymous says:

    Installed .net version 2 and all worked using new mscoree.dll

    Thanks

  21. Anonymous says:

    i need help

    Fehler 1935.An error occurred during the installation of assembly

    `Microsoft_VsaVb,Version="7.0.5000.0",PublicKey Token="b03f5f7f11d50a3a",Cultire="neutral",FileVersion="7.10.3052.4".

  22. Anonymous says:

    Thanks!  Making the changes you suggested for WinXP (renaming mscoree.dll and removing urttemp directory) did the job.

    Thanks thanks thanks!

  23. Hi Marco – There is not enough information in the snippet of the error message that you included in your comment to figure out what the root cause is.  Can you open up %temp%vsmsilog*.txt and search for "return value 3" and then find the HRESULT value for this error code?  That will help us figure out the best next step to take to solve this.

  24. Anonymous says:

    I find this here

    [02/19/06,14:34:40] Starting Install.exe

    [02/19/06,14:34:40] Parsing switches from commandline: C:DOKUME~1SEEHOL~1LOKALE~1TempIXP000.TMPInstall.exe

    [02/19/06,14:34:40] SourceDir: C:DOKUME~1SEEHOL~1LOKALE~1TempIXP000.TMP

    [02/19/06,14:34:40] Install started

    [02/19/06,14:34:40] Checking system requirements

    [02/19/06,14:34:40] OS: Win 2k

    [02/19/06,14:34:40] Ver:

    [02/19/06,14:34:40] SP: Service Pack 4

    [02/19/06,14:34:40] Checking Internet Explorer Version

    [02/19/06,14:34:40] Looking for 5.0.2919.6307

    [02/19/06,14:34:40] Found Internet Explorer Version: 6.0.2800.1106

    [02/19/06,14:34:40] Internet Explorer Version is OK…

    [02/19/06,14:34:40] System meets minimum requirements

    [02/19/06,14:34:40] Checking Windows Installer version…

    [02/19/06,14:34:40] Trying to load msi.dll

    [02/19/06,14:34:40] Loading: C:WINNTsystem32\msi.dll

    [02/19/06,14:34:40] msi.dll loaded ok

    [02/19/06,14:34:40] Looking for: 2.0.2600

    [02/19/06,14:34:40] Found: 3.1.4000

    [02/19/06,14:34:40] Windows Installer version ok

    [02/19/06,14:34:40] Finished Checking Windows Installer version.

    [02/19/06,14:34:40] Trying to load msi.dll

    [02/19/06,14:34:40] Loading: C:WINNTsystem32\msi.dll

    [02/19/06,14:34:40] Looking for mscoree.dll from PDC

    [02/19/06,14:34:40] mscoree.dll from PDC is not installed local

    [02/19/06,14:34:40] Looking for mscoree.dll from Beta

    [02/19/06,14:34:40] mscoree.dll is not installed local

    [02/19/06,14:34:40] Trying to load msi.dll

    [02/19/06,14:34:40] Loading: C:WINNTsystem32\msi.dll

    [02/19/06,14:34:40] Installing: C:DOKUME~1SEEHOL~1LOKALE~1TempIXP000.TMPnetfx.msi

    [02/19/06,14:34:40] Checking IIS…

    [02/19/06,14:34:40] IIS not found

    [02/19/06,14:34:40] Checking MDAC Version

    [02/19/06,14:34:40] Looking for 2.70.7713.0

    [02/19/06,14:34:40] Found MDAC Version: 2.70.9001.0

    [02/19/06,14:34:40] MDAC Version OK

    [02/19/06,14:34:41] StopDarwinService(): Darwin service successfully stopped

    [02/19/06,14:34:41] Trying to load msi.dll

    [02/19/06,14:34:41] Loading: C:WINNTsystem32\msi.dll

    [02/19/06,14:34:41] Full UI

    [02/19/06,14:34:41] Calling MsiInstallProduct() with commandline: REBOOT=ReallySuppress IIS_NOT_PRESENT=1

    [02/19/06,14:35:20] MsiInstallProduct() returned 1603

    [02/19/06,14:35:20]

    [MsiInstallProduct]

    ReturnCode=1603

    [02/19/06,14:35:20] Preparing Dialog

    [02/19/06,14:35:20] Message: Fehler beim Setup von "Microsoft .NET Framework". Wenden Sie sich an den Produktsupport, wenn das Problem weiterhin auftritt.

    [02/19/06,14:35:21] Install.exe returning 1603

    [02/19/06,14:35:21]

    [Install.exe]

    ReturnCode=1603

  25. Hi Marco – that log file is not a verbose MSI log file.  The problem is that error code 1603 is a generic failure code that could have many possible root causes, so we need to look at the verbose log file for more detailed information.  Can you please use the steps listed at http://blogs.msdn.com/astebner/archive/2005/03/29/403575.aspx to enable verbose logging and gather a verbose log file for the .NET Framework setup and then contact me using http://blogs.msdn.com/astebner/contact.aspx so I can try to take a look and see if I can figure out what is causing this on your system?

  26. Anonymous says:

    I am trying to install Visual Studio .NET 2003 and getting the below error almost at 80% of install stage.

    Product: Visual Studio .NET Enterprise Architect 2003 – English — Error

    1937.An error occurred during the installation of assembly

    ‘System.CF.Design,Version="7.0.5000.0",PublicKeyToken="b03f5f7f11d50a3a",Cul

    ture="neutral",FileVersion="7.10.2292.0"’. The signature or catalog could

    not be verified or is not valid. HRESULT: 0x80131045

    I tried few things I tried copying another version of mscoree.dll from i386 folder,

    tried on other machine,

    disabled the anti virus and tried but no luck.

    Any help would be appreciated.

    Thank you

    Mahesh

  27. Anonymous says:

    Hello. I need help too. During installation Framework 1.1 I have:

    Error 1935.An error occurred during the installation of assembly ‘System.Web.Mobile,Version="1.0.5000.0",PublicKeyToken="b03f5f7f11d50a3a",Culture="neutral",FileVersion="1.1.4322.573"’. Please refer to Help and Support for more information. HRESULT: 0x80070003.

    In the log I have:

    MSI (s) (70:F0) [21:26:28:386]: Note: 1: 1402 2: HKEY_CLASSES_ROOT.1 Wizards 3: 2

    MSI (s) (70:F0) [21:26:28:416]: Executing op: ActionStart(Name=CA_PatchInstall.3643236F_FC70_11D3_A536_0090278A1BB8,,)

    Action 21:26:28: CA_PatchInstall.3643236F_FC70_11D3_A536_0090278A1BB8.

    MSI (s) (70:F0) [21:26:28:487]: Executing op: CustomActionSchedule(Action=CA_PatchInstall.3643236F_FC70_11D3_A536_0090278A1BB8,ActionType=3682,Source=C:WINDOWSMicrosoft.NETFramework,Target="C:WINDOWSMicrosoft.NETFrameworknetfxsbs11.exe" /install,)

    MSI (s) (70:F0) [21:26:28:517]: Executing op: End(Checksum=0,ProgressTotalHDWord=0,ProgressTotalLDWord=113278965)

    MSI (s) (70:F0) [21:26:31:020]: Assembly Error

    As I found 0x80070003 means COR_E_DIRECTORYNOTFOUND, but I don’t what to do with this. I hope you’ll help me! Thanks. Sorry for my English 🙂

  28. Hi Oleg – Error code 0x80070002 and 0x80070003 tend to have the same set of root causes.  I have written a couple of suggestions at http://blogs.msdn.com/astebner/archive/2005/02/01/364375.aspx and also several customers have added additional suggestions that worked for them.  Can you please check out that blog post and see if the information there helps in your scenario?

  29. Hi Mahesh – It might be useful for you to try to remove the .NET Framework 1.1, reinstall it and then try to install VS 2003 again.  You can find steps for removing the .NET Framework 1.1 at http://blogs.msdn.com/astebner/archive/2005/10/11/479928.aspx.  Hope this helps!

  30. Anonymous says:

    1935 HRESULT 2147319761 IN HP 1510V INSTALL

    I just wanted to say thanks for your message board. I was having trouble installing my wife’s new hp 1510 scanner printer. I got a 1935 error.

    I noted from all the internet logs that this has been a fairly widespread problem. After having tried at least half of the procedures on your webpage, I noted the text that referred to broken installations.

    I went into the net framework area and found another later version that did not appear in win98 ad/rem section of control panel.

    I moved everything out of that folder into another folder of a different temp name.

    Then I ran dotnetfx.exe and after the reinstall it came up fine on the software install.

    I might note that the later version of framework was not even listed in the ad/rem sections of win98 control panel.

    Hope this helps someone get up and running faster than the days it took me

    sglover8@carolina.rr.com

                   steve

  31. Anonymous says:

    Thanks for this blog!!!

    It was awesme. I could fix the problem I was having with the mscoree.dll, plus I could understand a lot of what was going on!!

    Thanks!!!!

  32. Anonymous says:

    When loading .net 2:

    I get – Error 25015 Failed to install C:…VisualBasic.VSA.dll  0x80131046

    Can I follow the procedure you have and expect good results?

    Other sites with possible fixes?

  33. Hi Paul – Can you please use the steps listed at http://blogs.msdn.com/astebner/archive/2005/04/16/408856.aspx to manually remove and then try to reinstall the .NET Framework 2.0 and see if it helps resolve this issue?

  34. Anonymous says:

    I tried the procedure at

    http://blogs.msdn.com/astebner/archive/2005/04/16/408856.aspx

    several times.  No luck.  Same

    Error 25015 Failed to install C:…VisualBasic.VSA.dll  0x80131046

  35. Hi Paul – I am not sure what might be causing this issue on your system.  You are entitled to a free technical support call for setup-related .NET Framework issues, so I think the best option would be for you to contact the Microsoft technical support team for additional assistance.  I’m sorry I haven’t been able to be more helpful.

  36. Anonymous says:

    Hi Everybody,

    I have same problem as mahesh. I uninstalled .NET 1.1 and installed it again. But still problem remain as it is.

    Any help in this case will be appreciated.

    Regards.

  37. Anonymous says:

    Kent Damgaard you are my #$#*(NG hero!

    Your post is the only one I have found with erros matching mine (from J# redistributable during VS install).  Reinstalling .NET 2.0 solved my issues just like you said.

    THANK YOU

  38. Hi Nirav – Can you please try to use the steps listed at http://blogs.msdn.com/astebner/archive/2005/10/11/479928.aspx to try to cleanup the failed .NET Framework 1.1 install and then try to install it again?

  39. Anonymous says:

    After much wasted time trying to follow MS KB fixes that didn’t work, stopping here solved my problem with 1935 error on a Win98 system.

    I deleted urttemp folder and renamed mscoree.dll, turned off startup, antivirus. I installed 1.0 first and then rebooted and installed 1.1 next. That’s what I needed to do so I could install Quickbooks. Thanks.

    rob

  40. Anonymous says:

    Running XP SP2 – received the described error. Renamed the %SystemRoot%mscoree.dll to mscoree.old. Copied the mscoree.dll from the Service Pack 2, I386 directory to %Systemroot%, rerun setup…. No problem at all.

    Thanks for your assistance – appreciated.

    JB

  41. Anonymous says:

    I have a new machine with Windows XP 64 installed and I get a forest of 2908 and 1935 errors when I run dotnetfx.exe

    Are there specific steps to avoid these errors

    when XP 64 is installed?

    Thanks

  42. Anonymous says:

    error1935.error occured during the instalation of assembly ‘hpqcmctl,Version = "3.0.0.0." public key token="A53CF5803F4C3827" culture= "Neutral" please refer to help and support for information HRESULT:0X8002802F

    The problem I am having is that I can no longer scan on my HP 2110 all purpose printer?

    HELP

  43. Anonymous says:

    error1935.error occured during the instalation of assembly ‘hpqcmctl,Version = "3.0.0.0." public key token="A53CF5803F4C3827" culture= "Neutral" please refer to help and support for information HRESULT:0X8002802F

    The problem I am having is that I can no longer scan on my HP 2110 all purpose printer?

    HELP

  44. Hi Leo – This particular HRESULT value means "function not defined in specified DLL."  You can normally solve this issue with these steps (also listed above in the main blog post):

    1.  Rename the file %windir%system32mscoree.dll (or %windir%systemmscoree.dll on Windows 98 and Windows Me).

    2.  Delete the folder %windir%system32urttemp (or %windir%systemurttemp on Windows 98 and Windows ME) if it exists.

    3.  If you are trying to repair the .NET Framework v1.0, locate the file repair.htm in the folder %windir%Microsoft.NETFrameworkv1.0.3705 and follow the instructions on that page.

    4.  If you are trying to repair the .NET Framework v1.1, locate the file repairRedist.htm in the folder %windir%Microsoft.NETFrameworkv1.1.43221033 and follow the instructions on that page.

    5.  Rerun the setup that failed originally.

  45. Hi Norm – What is the exact HRESULT value that you get on your Windows XP 64-bit system?  You may want to try the renaming suggestions that are listed above and see if they help.

  46. Greghar says:

    I get the following error msgs and can’t fix the problem. This happens when each time the install gets 99-100% complete.  Would you know what I may do to fix it??

    Error 1935 – An error occurred during installation assembly.

    ‘Microsoft.MSXML2,publicKeyToken="6bd6b9abf345378f",version="4.1.0.0",type="win32",processorArchiture="x86"’. Please refer to Help and support for more information.

    HRESULT: 0x80070002.

    Then the install performs a rollback of install and gives another error msg – Error 1603: Fatal error during installation. Consult Windows Installer Help (Msi.chm) or MSDN for more info.

    I uninstalled the .Net Framework and reinstalled it to the current version 2, but it still didn’t help. Very frustrating…. your advice is appreciated.

  47. Hi Greghar – Can you please try the workarounds posted by myself and other customers in my blog item at http://blogs.msdn.com/astebner/archive/2005/02/01/364375.aspx and see if any of them help solve this issue on your system?

  48. Anonymous says:

    thanks man , youre informations were really helpfull.

    peace

  49. Anonymous says:

    Details about the .NET Framework 2.0 setup packaging Available command line switches for .NET Framework

  50. LuisP says:

    Hi! I dont know what else to do.

    I’ve tried to install my new game MS Flight Simulator X, but in the end gives me this error, and I dont know what to do.

    Please help.

    Error 1935. An error occurred during the installation of assembly ‘Microsoft.FlightSimulator,SimConnect,

    publickeyToken="67c7c14424d61b5b", version="10.0.60905.0", type="win32", processorArchitecture="x86". Please refer to help and Support for more information. HRESULT: 0x800736E7.

  51. Hi LuisP – It sounds like there might be some kind of problem with MSXML on your system.  Can you please try to run the MSXML MSI on the root of your installation disc and then try to install Flight Simulator X again and see if that helps solve this problem?

    If that does not help, it might also help to do the following:

    1.  Click on the Start menu, choose Run, type msconfig and click OK

    2.  Go to the Startup tab and click the button to disable all startup programs

    3.  Go to the services tab, check Hide All Microsoft Services and disable the rest of the services on the system

    4.  Click OK to accept the changes

    5.  Reboot and try to install again

  52. LuisP says:

    Hi again. Thanks for the help, but Im afraid that didnt worked.

    I’ve run the MSXML MSI at the root, the MSXML4 SP2. And made all the steps you said. But apears

    the same 1935 error. I forgot to say, but after I press OK to the 1935 error, the game UnInstall automatic and at the end gives me a "fatal error -1603" and it says for I check for "help on the MSDN" or someting like that, sorry i dont remenber   all the words. I dont know, but It may help you help me. Help me please, I would like to play this game.

  53. brute says:

    hi

    i got a problem with installing microsoft .NET 1.1

    After the installation is almost completed i get the following error:

    Error 1935 An error ocurred during installation of assembly "Microsoft.Vsa.Vb.CodeDOMProcessor,Version="7.0.5000.0",PublicKeyToken="b03f5f7f11d50a3a",culture="neutral",FileVersion="7.10.3052.4"

  54. Hi Brute – I would suggest first trying the steps listed at http://blogs.msdn.com/astebner/archive/2005/10/11/479928.aspx.  If that doesn’t help, you can use the steps at http://blogs.msdn.com/astebner/archive/2005/03/29/403575.aspx to gather a verbose log file from setup, and you can send it to me at Aaron.Stebner (at) microsoft (dot) com and I’ll try to take a look and see if I can figure anything out.

    Hope this helps!

  55. orko says:

    I have same problem with LuisP. I have installed MSXML MSI. It did not work. Furthermore i have tried msconfig way to solve problem but it did not wor,k too. What is problematical i don’t know. I have framework updates on windows update website. May it framwork problem? I am going to update it.

    Thanks.

  56. Anonymous says:

    Visual Studio 2005 SP1 Troubles: 2908 error

  57. Anonymous says:

    Visual Studio 2005 SP1 Troubles: 2908 error

  58. Anonymous says:

    Question: I am attempting to create an MSI-based setup for my application. This application needs to

  59. Anonymous says:

    A while back, I posted an article describing causes of many types of 1935 errors that have been seen

  60. nkirankumar@hotmail.com says:

    I am getting the following error when i am trying to GAC one of the .net assemblies using WIX.

    The installer has encountered an unexpected error installing this package. This may indicate a problem with this package. The error code is 2835. The arguments are: ErrorIcon, ErrorDialog,

    Error 1935. An error occurred during the installation of assembly ‘AssemblyLoader,version="14.0.0.0",culture="neutral",publicKeyToken="31BF3856AD364E35",processorArchitecture="MSIL"’. Please refer to Help and Support for more information. HRESULT: 0x80131043. assembly interface: IAssemblyCacheItem, function: Commit, component: {A96229E0-58B9-4C1B-9A62-1DA98FA7A9A2}

    MSI (s) (B0:90) [17:38:13:441]: Product: ExTest — Error 1935. An error occurred during the installation of assembly ‘AssemblyLoader,version="14.0.0.0",culture="neutral",publicKeyToken="31BF3856AD364E35",processorArchitecture="MSIL"’. Please refer to Help and Support for more information. HRESULT: 0x80131043. assembly interface: IAssemblyCacheItem, function: Commit, component: {A96229E0-58B9-4C1B-9A62-1DA98FA7A9A2}

    Action ended 17:38:13: InstallFinalize. Return value 3.

    I am able to successfully GAC the same assembly using gacutil.exe. any idea why I can’t do it using MSI?

    Thanks in advance!

  61. Hi NKiranKumar – The error code you are getting is 0x80131043.  According to the chart at the top of this blog post, it means "Modules which are not in the manifest were streamed in."  This most likely means that your assembly component contains other files that are not a part of this assembly.  You will need to double check your WXS file and make sure that you are only installing one assembly per component (unless the assembly consists of multiple files and is a multi-module assembly).

    If you have any trouble figuring out what to change to fix this, you can send me your WXS file and I will try to take a look.  You can send it to Aaron.Stebner (at) microsoft (dot) com.

  62. Guy007 says:

    Hi Aaron!

    I have been trying desperately to install VS 2005 Pro for days now, but no success!

    I am getting RESULT -2147023293, during installation with the following error:

    during the installation of assembly ‘Microsoft.VC80.ATL,type="win32",version="8.0.50727.42",publicKeyToken="1fc8b3b9a1e18e3b",processorArchitecture="amd64"’

    I previously had VS installed, but i removed everything using tools downloaded from Microsoft!

    Any ideas why this is happening!?

    i checked c:windowswinsxs and found the following:

    • x86_microsoft.vc80.atl_1fc8b3b9a1e18e3b_8.0.50727.42_none_dc990e4797f81af1
    • x86_microsoft.vc80.atl_1fc8b3b9a1e18e3b_8.0.50727.762_none_11ecb0ab9b2caf3c

    if it makes any difference…

    More info about my problem can be found at http://forums.microsoft.com/MSDN/ShowPost.aspx?PostID=2417626&SiteID=1&mode=1

    Thanks!

  63. Hi Guy007 – I’m very sorry for the hassle this issue is causing for you.

    This error that you are getting means “The referenced assembly is not installed on your system.”  On Windows Vista, this means that there is something wrong with the OS component store.  I haven’t been able to find a good solution for fixing a system that has gotten into this state yet though.  In the past I’ve suggested trying the steps listed at http://blogs.msdn.com/astebner/archive/2007/03/26/how-to-repair-the-net-framework-2-0-and-3-0-on-windows-vista.aspx, but it hasn’t been helpful in most cases.

    There might also be some information in the file c:windowslogscbscbs.log that could help troubleshoot this error.  If you’d like to zip and send me that log file, I can take a look and see if I can figure anything out to help in this scenario.

    If none of the above help, you will likely need to repair/re-install your Windows Vista OS to resolve this issue.

  64. JimSelf says:

    hi.. can you help with this?

    OS-> Vista 32bit..

    thanks.. i have no idea.. nothing works yet

    Product: VC Runtimes MSI — Error 1935.An error occurred during the installation of assembly ‘Microsoft.VC90.ATL,version="9.0.21022.8",publicKeyToken="1fc8b3b9a1e18e3b",processorArchitecture="x86",type="win32"’. Please refer to Help and Support for more information. HRESULT: 0x8007054F. assembly interface: IAssemblyCacheItem, function: Commit, component: {76C3F0F6-9B9D-35DA-81C6-CA8A88CC93CA}

  65. Hi JimSelf – I’m sorry for the hassle that this issue is causing for you.  The error code 0x8007054F is a generic error that means "an internal error occurred."  Since this is happening on a Windows Vista system, this type of error will result in a more detailed error message being logged to the file c:windowslogscbscbs.log.  It might help to search for this error code in this cbs.log file and see if it helps narrow down the root cause further.

  66. petr.hlavka@avg.com says:

    Hello,

    I’m getting this error when installing VC++ 2005 Redists on Vista x86 system

    Product: Microsoft Visual C++ 2005 Redistributable – Error 1935.An error occurred during the installation of assembly policy.8.0.Microsoft.VC80.CRT,type="win32-policy",version="8.0.50727.762",publicKeyToken="1fc8b3b9a1e18e3b",processorArchitecture="x86". Please refer to Help and Support for more information. HRESULT: 0x8007371B. assembly interface: IAssemblyCacheItem, function: Commit, component: {63E949F6-03BC-5C40-A01F-C8B3B9A1E18E}

    Please, can someone point me what the HRESULT 0x8007371B means?

  67. Hi Petrhlavka – When an MSI installs Win32 assemblies on Windows Vista, Windows Installer uses the underlying OS servicing APIs to try to install it.  That means, if there are any Win32 assembly install failures, you can find more detailed error information in the log named c:WindowsLogsCbsCbs.log.  That log should include a more specific explanation for that HRESULT.  Cbs.log tends to be very long, so what I typically do is find the timestamp values in the verbose MSI log and then correlate that time to the timestamps in cbs.log to narrow down the exact error.

    Hopefully this helps.

  68. speltz says:

    In January I install a Deployment Server BDD 2007 and everything was working perfect!

    Now we moved the server to another subnet and the problems came puring down on me:-)

    First I wasn’t able to PXE boot from clients, but this was fixed with further add to DHCP scope option 67(Boot file name) pointing at wdsnbp.com in the Remoteinstallboot directory.

    Then I had to copy the wim file from x86 directory to x64 in the same bootimages directory, and now I can load Vista images on my clients again.

    But now I have problems specially with installing MS Office 2007 +SP1. It pops up with an return code 1935???. Also an error code saying"Warning – unable to set working directory????

  69. Hi Speltz – There are a lot of possible root causes of 1935 errors – some are related to the .NET Framework and some are not.  You will likely need to look at the verbose log files from Office setup to narrow down this error further.  You can find information about the names and locations of log files created by Office setup at http://technet2.microsoft.com/Office/en-us/library/e16af71c-fed4-40da-a886-95e596c3999e1033.mspx?mfr=true and http://technet2.microsoft.com/Office/en-us/library/6e8f6aee-1a3c-4b1a-a70e-e6d0d6018b341033.mspx?mfr=true.

  70. orico says:

    I have a single DLL assembly I want to add to GAC using a WIX generated installation MSI.

    I have the following WIX XML to have that done:

    <Component Id=’FileManipulationMod’

    Guid=’C1428814-3096-11DD-8D96-758F56D89593′>

     <File Id=’FmAssmbly’

           Name=’GacFmDll’

           DiskId=’1′

    src=’Gizmox.WebGUI.Deployment.FileManipulation.dll’

           Vital=’yes’

           Assembly=’.net’

           KeyPath=’yes’ />

    </Component>

    When running the generated MSI I get a 1935 error with an HRESULT: 0x80131047.

    When I manually add this DLL to the GAC there is not problem.

    What do I need to do?

  71. Hi Orico – It looks like the issue here is that the Name value you’re using to install the assembly to disk is GacFmDll instead of the full DLL name.  Can you try changing GacFmDll to Gizmox.WebGUI.Deployment.FileManipulation.dll, rebuild your MSI and see if the install will work as expected after doing that?

  72. Anonymous says:

    Recently, I heard from a customer who was attempting to create an MSI-based installer using WiX v3.0

  73. knightonquest says:

    Hi,

    I am using one third party software – "orsus" which is dependent on .Net framework 1.1 I am getting following error on some user’s machines –

    HRESULT: 0x80004005

    Error 1935.An error occurred during the installation of assembly ‘Orsus.Scheduler.Controller,Version="value",PublicKeyToken="dd6a88441f29783d",Culture="value"’. Please refer to Help and Support for more information. HRESULT: 0x80004005. assembly interface: IAssemblyCacheItem, function: Commit, component: {0F8EC6E2-D75A-4BA5-9590-FA248B7A3322}

    I followed all of your steps –

    uninstall higher .net versions, removal of mscorree.dll file before installing .net framework 1.1, enable logging, remove registry keys for higher .net versions etc

    but nothing helped. I have the log file with me.

    Please advise. Really need your help.

    Thanks in Advance.

  74. Hi Knightonquest – Unfortunately, the HRESULT you are receiving is just a generic E_FAIL error and doesn’t help much in providing a root cause.  I’ve got a few questions to try to narrow this down further:

    1.  What OS are you seeing this error on?

    2.  Do you have problems installing any other .NET applications, or only this one?

    3.  Do you see this error on multiple computers or only on one specific computer?

    4.  Can you try to use the steps listed at http://blogs.msdn.com/astebner/archive/2008/03/07/8108332.aspx to remove all versions of the .NET Framework, then install back the .NET Framework 3.5 SP1, then the .NET Framework 1.1 and 1.1 SP1 and see if that helps resolve this issue?

  75. knightonquest says:

    Hi Aaron,

    Thanks a lot for your reply. Given below are answers to your questions –

    1) Windows XP Professional with SP2

    2) I didn’t try with any other application, but I believe this is one

    3) This error I have seen only on 3 user machines out of user base of ~300

    4) ok, I will try the steps given and get back to you.

    This application which I am using is dependent on .Net framework 1.1 only. It doesn’t work with any other higher version of .Net.

    and in this case .Net 1.1 installation completes successfully, but the application installation fails.

    Regards.

  76. Hi Knightonquest – Even if the application depends specifically on the .NET Framework 1.1, Windows Installer can end up using the .NET Framework 2.0 to install assemblies if it is present on the system too.

    Do these affected systems also have the .NET Framework 1.1 SP1?

    Are you the manufacturer of this application?  If not, and if this is the only application you are seeing this error for, you may want to ask the manufacturer of this application if they have any known issues.  It is also possible that this is a bug in the application itself as opposed to a .NET Framework bug.

  77. knightonquest says:

    Hi Aaron,

    .Net framework 1.1 SP1 is not on those machines. Do you recommend to install the same?

    I am not the manufacturer of this application. Manufacturer has stopped supporting this application, so that option is closed 🙁

    As it works for most of the users, am wondering if there are any tricks which can enable us to install the application.

    Regards.

  78. Hi Knightonquest – I’m not sure if installing the .NET Framework 1.1 SP1 will help or not.  It might also help to install .NET 2.0 on the affected systems, then reboot and try to install again.  It would also be really good to know if this error happens for any other .NET applications or if it is specific to this one.

  79. knightonquest says:

    Hi Aaron,

    Would it make sense to get help of paid Microsoft support to resolve this issue? We need to get this one resolved asap.

    Please advise.

    Thanks

  80. Hi Knightonquest – It is definitely an option for you to try contacting Microsoft technical support for more detailed troubleshooting of this issue.  However, if this issue is specific to this one application, I’m not sure they will be able to fix it for you because in that case it would likely require a fix to the product itself.  Microsoft technical support should be able to help you definitively narrow down whether or not this issue is specific to this one application or a symptom of a more general problem though, which would be really useful as a starting point.

  81. rjshook says:

    Regarding knightonquest’s

    HRESULT: 0x80004005

    Error 1935.An error occurred during the installation of assembly ‘Orsus.Scheduler.Controller,Version="value",PublicKeyToken="dd6a88441f29783d",Culture="value"’. Please refer to Help and Support for more information. HRESULT: 0x80004005. assembly interface: IAssemblyCacheItem, function: Commit, component: {0F8EC6E2-D75A-4BA5-9590-FA248B7A3322}

    I went into c:windowsassemblies and deleted the Orsus related Assemblies and then it installed cleanly.

    In a more generic sense, the installation program seemed to be trying to create/update/modify an assembly and could not. After deleting the assembly, it worked without any errors.

    -Ryan

  82. Hi Rjshook – Thank you for this additional information.  Do you know how those Orsus-related assemblies got into the GAC on that system in the first place?  Were they different versions than the ones that were attempted to be installed when the 0x80004005 error started appearing?  It seems like some other version of that Orsus package may have installed some bad assemblies that interfered with installation of future versions of their assemblies on that system.

  83. sh88 says:

    Hi,

    I wonder if you could help me fix the following ……. I’ve also included the Log from the Net_Framework setup verification tool :-

    I’m having problems trying to install various software programs, I think the problems may be linked.

    The Details are listed below, I’m running Vista Home Premium 64bit SP2.

    Tried installing Security Update for Microsoft Visual C++ 2005 Service Pack 1 Redistributable Package (KB973923)

    Installation date: ‎06/‎09/‎2009 16:57

    Installation status: Failed

    Error details: Code 643

    also tried installing Microsoft .NET Framework 3.5 Service Pack 1 and .NET Framework 3.5 Family Update (KB951847) x64

    Installation date: ‎06/‎09/‎2009 16:56

    Installation status: Failed

    Error details: Code 643

    Here are some more details, which I hope are relevant :-

    Log Name:      Application

    Source:        MsiInstaller

    Date:          06/09/2009 16:57:27

    Event ID:      11935

    Task Category: None

    Level:         Error

    Keywords:      Classic

    User:          SYSTEM

    Computer:      Owner-PC

    Description:

    Product: Microsoft Visual C++ 2005 ATL Update kb973923 – x86 8.0.50727.4053 — Error 1935.An error occurred during the installation of assembly ‘Microsoft.VC80.ATL,type="win32",version="8.0.50727.4053",publicKeyToken="1fc8b3b9a1e18e3b",processorArchitecture="x86"’. Please refer to Help and Support for more information. HRESULT: 0x80070003. assembly interface: IAssemblyCache, function: CreateAssemblyCacheItem, component: {97F81AF1-0E47-DC99-A01F-C8B3B9A1E18E}

    Event Xml:

    <Event xmlns="http://schemas.microsoft.com/win/2004/08/events/event"&gt;

     <System>

       <Provider Name="MsiInstaller" />

       <EventID Qualifiers="0">11935</EventID>

       <Level>2</Level>

       <Task>0</Task>

       <Keywords>0x80000000000000</Keywords>

       <TimeCreated SystemTime="2009-09-06T15:57:27.000Z" />

       <EventRecordID>16458</EventRecordID>

       <Channel>Application</Channel>

       <Computer>Owner-PC</Computer>

       <Security UserID="S-1-5-18" />

     </System>

     <EventData>

       <Data>Product: Microsoft Visual C++ 2005 ATL Update kb973923 – x86 8.0.50727.4053 — Error 1935.An error occurred during the installation of assembly ‘Microsoft.VC80.ATL,type="win32",version="8.0.50727.4053",publicKeyToken="1fc8b3b9a1e18e3b",processorArchitecture="x86"’. Please refer to Help and Support for more information. HRESULT: 0x80070003. assembly interface: IAssemblyCache, function: CreateAssemblyCacheItem, component: {97F81AF1-0E47-DC99-A01F-C8B3B9A1E18E}</Data>

       <Data>(NULL)</Data>

       <Data>(NULL)</Data>

       <Data>(NULL)</Data>

       <Data>(NULL)</Data>

       <Data>

       </Data>

       <Data>

       </Data>

       <Binary>7B37373036353744302D413132332D334330372D384534342D3143383345433839353131387D</Binary>

     </EventData>

    </Event>

    ======================================================================

    [09/10/09,16:16:50] Beginning of new SetupVerifier activity logging session

    [09/10/09,16:16:50] Activity log file location: C:UsersOwnerAppDataLocalTempsetupverifier_main_09-10-09_16.16.50.txt

    [09/10/09,16:16:50] Error log file location: C:UsersOwnerAppDataLocalTempsetupverifier_errors_09-10-09_16.16.50.txt

    [09/10/09,16:16:50] Build created on July 17, 2009

    [09/10/09,16:16:50] Detected operating system: Windows Vista (x64)

    [09/10/09,16:16:50] Install state for .NET Framework 1.0: not installed.

    [09/10/09,16:16:50] Install state for .NET Framework 1.1: not installed.

    [09/10/09,16:16:50] Install state for .NET Framework 2.0: installed with service pack 2.

    [09/10/09,16:16:50] Install state for .NET Framework 3.0: installed with service pack 2.

    [09/10/09,16:16:50] Install state for .NET Framework 3.5: not installed.

    [09/10/09,16:16:50] Install state for .NET Framework 4 Client: not installed.

    [09/10/09,16:16:50] Install state for .NET Framework 4 Full: not installed.

    [09/10/09,16:16:51] Not adding product ‘.NET Framework 1.0’ because it is not currently installed

    [09/10/09,16:16:51] Not adding product ‘.NET Framework 1.1’ because it is not currently installed

    [09/10/09,16:16:52] Not adding product ‘.NET Framework 1.1 SP1’ because it is not currently installed

    [09/10/09,16:16:52] Not adding product ‘.NET Framework 2.0’ because it is not currently installed

    [09/10/09,16:16:52] Not adding product ‘.NET Framework 2.0 SP1’ because it is not currently installed

    [09/10/09,16:16:53] Not adding product ‘.NET Framework 3.0’ because it is not currently installed

    [09/10/09,16:16:53] Not adding product ‘.NET Framework 3.0 SP1’ because it is not currently installed

    [09/10/09,16:16:53] Not adding product ‘.NET Framework 3.5’ because it is not currently installed

    [09/10/09,16:16:53] Not adding product ‘.NET Framework 3.5 SP1’ because it is not currently installed

    [09/10/09,16:17:25] Starting verification for product .NET Framework 2.0 SP2

    [09/10/09,16:17:25] Section [Files – .NET Framework 2.0 (Common)] – start parsing entries

    [09/10/09,16:17:25] File C:Windowssystem32mscoree.dll is installed on the system

    [09/10/09,16:17:25] File C:Windowssystem32netfxperf.dll is installed on the system

    [09/10/09,16:17:25] File C:Windowssystem32dfshim.dll is installed on the system

    [09/10/09,16:17:25] File C:Windowssystem32mscorier.dll is installed on the system

    [09/10/09,16:17:25] File C:Windowssystem32mscories.dll is installed on the system

    [09/10/09,16:17:25] File C:Windowssystem32MUI409mscorees.dll is installed on the system

    [09/10/09,16:17:25] File C:WindowsAssemblyGAC_32CustomMarshalers2.0.0.0__b03f5f7f11d50a3aCustomMarshalers.dll is installed on the system

    [09/10/09,16:17:25] File C:WindowsAssemblyGAC_32ISymWrapper2.0.0.0__b03f5f7f11d50a3aISymWrapper.dll is installed on the system

    [09/10/09,16:17:25] File C:WindowsAssemblyGAC_32mscorlib2.0.0.0__b77a5c561934e089big5.nlp is installed on the system

    [09/10/09,16:17:25] File C:WindowsAssemblyGAC_32mscorlib2.0.0.0__b77a5c561934e089bopomofo.nlp is installed on the system

    [09/10/09,16:17:25] File C:WindowsAssemblyGAC_32mscorlib2.0.0.0__b77a5c561934e089ksc.nlp is installed on the system

    [09/10/09,16:17:25] File C:WindowsAssemblyGAC_32mscorlib2.0.0.0__b77a5c561934e089mscorlib.dll is installed on the system

    [09/10/09,16:17:25] File C:WindowsAssemblyGAC_32mscorlib2.0.0.0__b77a5c561934e089normidna.nlp is installed on the system

    [09/10/09,16:17:25] File C:WindowsAssemblyGAC_32mscorlib2.0.0.0__b77a5c561934e089normnfc.nlp is installed on the system

    [09/10/09,16:17:25] File C:WindowsAssemblyGAC_32mscorlib2.0.0.0__b77a5c561934e089normnfd.nlp is installed on the system

    [09/10/09,16:17:25] File C:WindowsAssemblyGAC_32mscorlib2.0.0.0__b77a5c561934e089normnfkc.nlp is installed on the system

    [09/10/09,16:17:25] File C:WindowsAssemblyGAC_32mscorlib2.0.0.0__b77a5c561934e089normnfkd.nlp is installed on the system

    [09/10/09,16:17:25] File C:WindowsAssemblyGAC_32mscorlib2.0.0.0__b77a5c561934e089prc.nlp is installed on the system

    [09/10/09,16:17:25] File C:WindowsAssemblyGAC_32mscorlib2.0.0.0__b77a5c561934e089prcp.nlp is installed on the system

    [09/10/09,16:17:25] File C:WindowsAssemblyGAC_32mscorlib2.0.0.0__b77a5c561934e089sortkey.nlp is installed on the system

    [09/10/09,16:17:25] File C:WindowsAssemblyGAC_32mscorlib2.0.0.0__b77a5c561934e089sorttbls.nlp is installed on the system

    [09/10/09,16:17:25] File C:WindowsAssemblyGAC_32mscorlib2.0.0.0__b77a5c561934e089xjis.nlp is installed on the system

    [09/10/09,16:17:25] File C:WindowsAssemblyGAC_32System.Data.OracleClient2.0.0.0__b77a5c561934e089System.Data.OracleClient.dll is installed on the system

    [09/10/09,16:17:25] File C:WindowsAssemblyGAC_32System.Data2.0.0.0__b77a5c561934e089System.Data.dll is installed on the system

    [09/10/09,16:17:25] File C:WindowsAssemblyGAC_32System.EnterpriseServices2.0.0.0__b03f5f7f11d50a3aSystem.EnterpriseServices.dll is installed on the system

    [09/10/09,16:17:25] File C:WindowsAssemblyGAC_32System.EnterpriseServices2.0.0.0__b03f5f7f11d50a3aSystem.EnterpriseServices.Wrapper.dll is installed on the system

    [09/10/09,16:17:25] File C:WindowsAssemblyGAC_32System.Transactions2.0.0.0__b77a5c561934e089System.Transactions.dll is installed on the system

    [09/10/09,16:17:25] File C:WindowsAssemblyGAC_32System.Web2.0.0.0__b03f5f7f11d50a3aSystem.Web.dll is installed on the system

    [09/10/09,16:17:25] File C:WindowsAssemblyGAC_MSILAccessibility2.0.0.0__b03f5f7f11d50a3aAccessibility.dll is installed on the system

    [09/10/09,16:17:25] File C:WindowsAssemblyGAC_MSILcscompmgd8.0.0.0__b03f5f7f11d50a3acscompmgd.dll is installed on the system

    [09/10/09,16:17:25] File C:WindowsAssemblyGAC_MSILIEExecRemote2.0.0.0__b03f5f7f11d50a3aIEExecRemote.dll is installed on the system

    [09/10/09,16:17:25] File C:WindowsAssemblyGAC_MSILIEHost2.0.0.0__b03f5f7f11d50a3aIEHost.dll is installed on the system

    [09/10/09,16:17:25] File C:WindowsAssemblyGAC_MSILIIEHost2.0.0.0__b03f5f7f11d50a3aIIEHost.dll is installed on the system

    [09/10/09,16:17:25] File C:WindowsAssemblyGAC_MSILMicrosoft.Build.Engine2.0.0.0__b03f5f7f11d50a3aMicrosoft.Build.Engine.dll is installed on the system

    [09/10/09,16:17:25] File C:WindowsAssemblyGAC_MSILMicrosoft.Build.Framework2.0.0.0__b03f5f7f11d50a3aMicrosoft.Build.Framework.dll is installed on the system

    [09/10/09,16:17:25] File C:WindowsAssemblyGAC_MSILMicrosoft.Build.Tasks2.0.0.0__b03f5f7f11d50a3aMicrosoft.Build.Tasks.dll is installed on the system

    [09/10/09,16:17:25] File C:WindowsAssemblyGAC_MSILMicrosoft.Build.Utilities2.0.0.0__b03f5f7f11d50a3aMicrosoft.Build.Utilities.dll is installed on the system

    [09/10/09,16:17:25] File C:WindowsAssemblyGAC_MSILMicrosoft.JScript8.0.0.0__b03f5f7f11d50a3aMicrosoft.JScript.dll is installed on the system

    [09/10/09,16:17:25] File C:WindowsAssemblyGAC_MSILMicrosoft.VisualBasic.Compatibility.Data8.0.0.0__b03f5f7f11d50a3aMicrosoft.VisualBasic.Compatibility.Data.dll is installed on the system

    [09/10/09,16:17:25] File C:WindowsAssemblyGAC_MSILMicrosoft.VisualBasic.Compatibility8.0.0.0__b03f5f7f11d50a3aMicrosoft.VisualBasic.Compatibility.dll is installed on the system

    [09/10/09,16:17:25] File C:WindowsAssemblyGAC_MSILMicrosoft.VisualBasic.Vsa8.0.0.0__b03f5f7f11d50a3aMicrosoft.VisualBasic.Vsa.dll is installed on the system

    [09/10/09,16:17:25] File C:WindowsAssemblyGAC_MSILMicrosoft.VisualBasic8.0.0.0__b03f5f7f11d50a3aMicrosoft.VisualBasic.dll is installed on the system

    [09/10/09,16:17:25] File C:WindowsAssemblyGAC_MSILMicrosoft.VisualC8.0.0.0__b03f5f7f11d50a3aMicrosoft.VisualC.Dll is installed on the system

    [09/10/09,16:17:25] File C:WindowsAssemblyGAC_MSILMicrosoft.Vsa.Vb.CodeDOMProcessor8.0.0.0__b03f5f7f11d50a3aMicrosoft.Vsa.Vb.CodeDOMProcessor.dll is installed on the system

    [09/10/09,16:17:25] File C:WindowsAssemblyGAC_MSILMicrosoft.Vsa8.0.0.0__b03f5f7f11d50a3aMicrosoft.Vsa.dll is installed on the system

    [09/10/09,16:17:25] File C:WindowsAssemblyGAC_MSILMicrosoft_VsaVb8.0.0.0__b03f5f7f11d50a3aMicrosoft_VsaVb.dll is installed on the system

    [09/10/09,16:17:25] File C:WindowsAssemblyGAC_MSILsysglobl2.0.0.0__b03f5f7f11d50a3asysglobl.dll is installed on the system

    [09/10/09,16:17:25] File C:WindowsAssemblyGAC_MSILSystem.Configuration.Install2.0.0.0__b03f5f7f11d50a3aSystem.Configuration.Install.dll is installed on the system

    [09/10/09,16:17:25] File C:WindowsAssemblyGAC_MSILSystem.Configuration2.0.0.0__b03f5f7f11d50a3aSystem.configuration.dll is installed on the system

    [09/10/09,16:17:25] File C:WindowsAssemblyGAC_MSILSystem.Data.SqlXml2.0.0.0__b77a5c561934e089System.Data.SqlXml.dll is installed on the system

    [09/10/09,16:17:25] File C:WindowsAssemblyGAC_MSILSystem.Deployment2.0.0.0__b03f5f7f11d50a3aSystem.Deployment.dll is installed on the system

    [09/10/09,16:17:25] File C:WindowsAssemblyGAC_MSILSystem.Design2.0.0.0__b03f5f7f11d50a3aSystem.Design.dll is installed on the system

    [09/10/09,16:17:25] File C:WindowsAssemblyGAC_MSILSystem.DirectoryServices.Protocols2.0.0.0__b03f5f7f11d50a3aSystem.DirectoryServices.Protocols.dll is installed on the system

    [09/10/09,16:17:25] File C:WindowsAssemblyGAC_MSILSystem.DirectoryServices2.0.0.0__b03f5f7f11d50a3aSystem.DirectoryServices.dll is installed on the system

    [09/10/09,16:17:25] File C:WindowsAssemblyGAC_MSILSystem.Drawing.Design2.0.0.0__b03f5f7f11d50a3aSystem.Drawing.Design.dll is installed on the system

    [09/10/09,16:17:25] File C:WindowsAssemblyGAC_MSILSystem.Drawing2.0.0.0__b03f5f7f11d50a3aSystem.Drawing.dll is installed on the system

    [09/10/09,16:17:25] File C:WindowsAssemblyGAC_MSILSystem.Management2.0.0.0__b03f5f7f11d50a3aSystem.Management.dll is installed on the system

    [09/10/09,16:17:25] File C:WindowsAssemblyGAC_MSILSystem.Messaging2.0.0.0__b03f5f7f11d50a3aSystem.Messaging.dll is installed on the system

    [09/10/09,16:17:25] File C:WindowsAssemblyGAC_MSILSystem.Runtime.Remoting2.0.0.0__b77a5c561934e089System.Runtime.Remoting.dll is installed on the system

    [09/10/09,16:17:25] File C:WindowsAssemblyGAC_MSILSystem.Runtime.Serialization.Formatters.Soap2.0.0.0__b03f5f7f11d50a3aSystem.Runtime.Serialization.Formatters.Soap.dll is installed on the system

    [09/10/09,16:17:25] File C:WindowsAssemblyGAC_MSILSystem.Security2.0.0.0__b03f5f7f11d50a3aSystem.Security.dll is installed on the system

    [09/10/09,16:17:25] File C:WindowsAssemblyGAC_MSILSystem.ServiceProcess2.0.0.0__b03f5f7f11d50a3aSystem.ServiceProcess.dll is installed on the system

    [09/10/09,16:17:25] File C:WindowsAssemblyGAC_MSILSystem.Web.Mobile2.0.0.0__b03f5f7f11d50a3aSystem.Web.Mobile.dll is installed on the system

    [09/10/09,16:17:25] File C:WindowsAssemblyGAC_MSILSystem.Web.RegularExpressions2.0.0.0__b03f5f7f11d50a3aSystem.Web.RegularExpressions.dll is installed on the system

    [09/10/09,16:17:25] File C:WindowsAssemblyGAC_MSILSystem.Web.Services2.0.0.0__b03f5f7f11d50a3aSystem.Web.Services.dll is installed on the system

    [09/10/09,16:17:25] File C:WindowsAssemblyGAC_MSILSystem.Windows.Forms2.0.0.0__b77a5c561934e089System.Windows.Forms.dll is installed on the system

    [09/10/09,16:17:25] File C:WindowsAssemblyGAC_MSILSystem.Xml2.0.0.0__b77a5c561934e089System.XML.dll is installed on the system

    [09/10/09,16:17:25] File C:WindowsAssemblyGAC_MSILSystem2.0.0.0__b77a5c561934e089System.dll is installed on the system

    [09/10/09,16:17:25] ****ERROR**** File C:WindowsMicrosoft.NETFrameworkNETFXSBS10.exe is not installed on the system

    [09/10/09,16:17:25] ****ERROR**** File C:WindowsMicrosoft.NETFrameworknetfxsbs12.hkf is not installed on the system

    [09/10/09,16:17:25] ****ERROR**** File C:WindowsMicrosoft.NETFrameworksbs_diasymreader.dll is not installed on the system

    [09/10/09,16:17:25] ****ERROR**** File C:WindowsMicrosoft.NETFrameworksbs_iehost.dll is not installed on the system

    [09/10/09,16:17:25] ****ERROR**** File C:WindowsMicrosoft.NETFrameworksbs_microsoft.jscript.dll is not installed on the system

    [09/10/09,16:17:25] ****ERROR**** File C:WindowsMicrosoft.NETFrameworksbs_microsoft.vsa.vb.codedomprocessor.dll is not installed on the system

    [09/10/09,16:17:25] ****ERROR**** File C:WindowsMicrosoft.NETFrameworksbs_mscordbi.dll is not installed on the system

    [09/10/09,16:17:25] ****ERROR**** File C:WindowsMicrosoft.NETFrameworksbs_mscorrc.dll is not installed on the system

    [09/10/09,16:17:25] ****ERROR**** File C:WindowsMicrosoft.NETFrameworksbs_mscorsec.dll is not installed on the system

    [09/10/09,16:17:25] ****ERROR**** File C:WindowsMicrosoft.NETFrameworksbs_system.configuration.install.dll is not installed on the system

    [09/10/09,16:17:25] ****ERROR**** File C:WindowsMicrosoft.NETFrameworksbs_system.data.dll is not installed on the system

    [09/10/09,16:17:25] ****ERROR**** File C:WindowsMicrosoft.NETFrameworksbs_system.enterpriseservices.dll is not installed on the system

    [09/10/09,16:17:25] ****ERROR**** File C:WindowsMicrosoft.NETFrameworksbs_VsaVb7rt.dll is not installed on the system

    [09/10/09,16:17:25] ****ERROR**** File C:WindowsMicrosoft.NETFrameworksbs_wminet_utils.dll is not installed on the system

    [09/10/09,16:17:25] ****ERROR**** File C:WindowsMicrosoft.NETFrameworksbscmp10.dll is not installed on the system

    [09/10/09,16:17:25] ****ERROR**** File C:WindowsMicrosoft.NETFrameworksbscmp20_mscorwks.dll is not installed on the system

    [09/10/09,16:17:25] ****ERROR**** File C:WindowsMicrosoft.NETFrameworksbscmp20_perfcounter.dll is not installed on the system

    [09/10/09,16:17:25] ****ERROR**** File C:WindowsMicrosoft.NETFrameworkSharedReg12.dll is not installed on the system

    [09/10/09,16:17:25] ****ERROR**** File C:WindowsMicrosoft.NETFrameworkv1.1.4322gacutil.exe.config is not installed on the system

    [09/10/09,16:17:25] ****ERROR**** File C:WindowsMicrosoft.NETFrameworkv1.1.4322regsvcs.exe.config is not installed on the system

    [09/10/09,16:17:25] ****ERROR**** File C:WindowsMicrosoft.NETFrameworkv2.0.507271033alinkui.dll is not installed on the system

    [09/10/09,16:17:25] ****ERROR**** File C:WindowsMicrosoft.NETFrameworkv2.0.507271033cscompui.dll is not installed on the system

    [09/10/09,16:17:25] ****ERROR**** File C:WindowsMicrosoft.NETFrameworkv2.0.507271033CvtResUI.dll is not installed on the system

    [09/10/09,16:17:25] ****ERROR**** File C:WindowsMicrosoft.NETFrameworkv2.0.507271033vbc7ui.dll is not installed on the system

    [09/10/09,16:17:25] ****ERROR**** File C:WindowsMicrosoft.NETFrameworkv2.0.507271033Vsavb7rtUI.dll is not installed on the system

    [09/10/09,16:17:25] ****ERROR**** File C:WindowsMicrosoft.NETFrameworkv2.0.50727Accessibility.dll is not installed on the system

    [09/10/09,16:17:25] ****ERROR**** File C:WindowsMicrosoft.NETFrameworkv2.0.50727AdoNetDiag.dll is not installed on the system

    [09/10/09,16:17:25] ****ERROR**** File C:WindowsMicrosoft.NETFrameworkv2.0.50727adonetdiag.mof is not installed on the system

    [09/10/09,16:17:25] ****ERROR**** File C:WindowsMicrosoft.NETFrameworkv2.0.50727alink.dll is not installed on the system

    [09/10/09,16:17:25] ****ERROR**** File C:WindowsMicrosoft.NETFrameworkv2.0.50727AppLaunch.exe is not installed on the system

    [09/10/09,16:17:25] ****ERROR**** File C:WindowsMicrosoft.NETFrameworkv2.0.50727Aspnet.config is not installed on the system

    [09/10/09,16:17:25] ****ERROR**** File C:WindowsMicrosoft.NETFrameworkv2.0.50727aspnet.mof is not installed on the system

    [09/10/09,16:17:25] ****ERROR**** File C:WindowsMicrosoft.NETFrameworkv2.0.50727aspnet.mof.uninstall is not installed on the system

    [09/10/09,16:17:25] ****ERROR**** File C:WindowsMicrosoft.NETFrameworkv2.0.50727aspnet_compiler.exe is not installed on the system

    [09/10/09,16:17:25] ****ERROR**** File C:WindowsMicrosoft.NETFrameworkv2.0.50727aspnet_filter.dll is not installed on the system

    [09/10/09,16:17:25] ****ERROR**** File C:WindowsMicrosoft.NETFrameworkv2.0.50727aspnet_isapi.dll is not installed on the system

    [09/10/09,16:17:25] ****ERROR**** File C:WindowsMicrosoft.NETFrameworkv2.0.50727Aspnet_perf.dll is not installed on the system

    [09/10/09,16:17:25] ****ERROR**** File C:WindowsMicrosoft.NETFrameworkv2.0.50727aspnet_perf.h is not installed on the system

    [09/10/09,16:17:25] ****ERROR**** File C:WindowsMicrosoft.NETFrameworkv2.0.50727aspnet_perf.ini is not installed on the system

    [09/10/09,16:17:25] ****ERROR**** File C:WindowsMicrosoft.NETFrameworkv2.0.50727aspnet_perf2.ini is not installed on the system

    [09/10/09,16:17:25] ****ERROR**** File C:WindowsMicrosoft.NETFrameworkv2.0.50727aspnet_rc.dll is not installed on the system

    [09/10/09,16:17:25] ****ERROR**** File C:WindowsMicrosoft.NETFrameworkv2.0.50727aspnet_regbrowsers.exe is not installed on the system

    [09/10/09,16:17:25] ****ERROR**** File C:WindowsMicrosoft.NETFrameworkv2.0.50727aspnet_regiis.exe is not installed on the system

    [09/10/09,16:17:25] ****ERROR**** File C:WindowsMicrosoft.NETFrameworkv2.0.50727aspnet_regsql.exe is not installed on the system

    [09/10/09,16:17:25] ****ERROR**** File C:WindowsMicrosoft.NETFrameworkv2.0.50727Aspnet_regsql.exe.config is not installed on the system

    [09/10/09,16:17:25] ****ERROR**** File C:WindowsMicrosoft.NETFrameworkv2.0.50727aspnet_state_perf.h is not installed on the system

    [09/10/09,16:17:25] ****ERROR**** File C:WindowsMicrosoft.NETFrameworkv2.0.50727aspnet_state_perf.ini is not installed on the system

    [09/10/09,16:17:25] ****ERROR**** File C:WindowsMicrosoft.NETFrameworkv2.0.50727aspnet_wp.exe is not installed on the system

    [09/10/09,16:17:25] ****ERROR**** File C:WindowsMicrosoft.NETFrameworkv2.0.50727big5.nlp is not installed on the system

    [09/10/09,16:17:25] ****ERROR**** File C:WindowsMicrosoft.NETFrameworkv2.0.50727bopomofo.nlp is not installed on the system

    [09/10/09,16:17:25] ****ERROR**** File C:WindowsMicrosoft.NETFrameworkv2.0.50727CasPol.exe is not installed on the system

    [09/10/09,16:17:25] ****ERROR**** File C:WindowsMicrosoft.NETFrameworkv2.0.50727caspol.exe.config is not installed on the system

    [09/10/09,16:17:25] ****ERROR**** File C:WindowsMicrosoft.NETFrameworkv2.0.50727CLR.mof is not installed on the system

    [09/10/09,16:17:25] ****ERROR**** File C:WindowsMicrosoft.NETFrameworkv2.0.50727CLR.mof.uninstall is not installed on the system

    [09/10/09,16:17:25] ****ERROR**** File C:WindowsMicrosoft.NETFrameworkv2.0.50727CONFIGBrowsersavantgo.browser is not installed on the system

    [09/10/09,16:17:25] ****ERROR**** File C:WindowsMicrosoft.NETFrameworkv2.0.50727CONFIGBrowserscassio.browser is not installed on the system

    [09/10/09,16:17:25] ****ERROR**** File C:WindowsMicrosoft.NETFrameworkv2.0.50727CONFIGBrowsersDefault.browser is not installed on the system

    [09/10/09,16:17:25] ****ERROR**** File C:WindowsMicrosoft.NETFrameworkv2.0.50727CONFIGBrowsersdocomo.browser is not installed on the system

    [09/10/09,16:17:25] ****ERROR**** File C:WindowsMicrosoft.NETFrameworkv2.0.50727CONFIGBrowsersericsson.browser is not installed on the system

    [09/10/09,16:17:25] ****ERROR**** File C:WindowsMicrosoft.NETFrameworkv2.0.50727CONFIGBrowsersEZWap.browser is not installed on the system

    [09/10/09,16:17:25] ****ERROR**** File C:WindowsMicrosoft.NETFrameworkv2.0.50727CONFIGBrowsersgateway.browser is not installed on the system

    [09/10/09,16:17:25] ****ERROR**** File C:WindowsMicrosoft.NETFrameworkv2.0.50727CONFIGBrowsersgeneric.browser is not installed on the system

    [09/10/09,16:17:25] ****ERROR**** File C:WindowsMicrosoft.NETFrameworkv2.0.50727CONFIGBrowsersgoAmerica.browser is not installed on the system

    [09/10/09,16:17:25] ****ERROR**** File C:WindowsMicrosoft.NETFrameworkv2.0.50727CONFIGBrowsersie.browser is not installed on the system

    [09/10/09,16:17:25] ****ERROR**** File C:WindowsMicrosoft.NETFrameworkv2.0.50727CONFIGBrowsersJataayu.browser is not installed on the system

    [09/10/09,16:17:25] ****ERROR**** File C:WindowsMicrosoft.NETFrameworkv2.0.50727CONFIGBrowsersjphone.browser is not installed on the system

    [09/10/09,16:17:25] ****ERROR**** File C:WindowsMicrosoft.NETFrameworkv2.0.50727CONFIGBrowserslegend.browser is not installed on the system

    [09/10/09,16:17:25] ****ERROR**** File C:WindowsMicrosoft.NETFrameworkv2.0.50727CONFIGBrowsersMME.browser is not installed on the system

    [09/10/09,16:17:25] ****ERROR**** File C:WindowsMicrosoft.NETFrameworkv2.0.50727CONFIGBrowsersmozilla.browser is not installed on the system

    [09/10/09,16:17:25] ****ERROR**** File C:WindowsMicrosoft.NETFrameworkv2.0.50727CONFIGBrowsersnetscape.browser is not installed on the system

    [09/10/09,16:17:25] ****ERROR**** File C:WindowsMicrosoft.NETFrameworkv2.0.50727CONFIGBrowsersnokia.browser is not installed on the system

    [09/10/09,16:17:25] ****ERROR**** File C:WindowsMicrosoft.NETFrameworkv2.0.50727CONFIGBrowsersopenwave.browser is not installed on the system

    [09/10/09,16:17:25] ****ERROR**** File C:WindowsMicrosoft.NETFrameworkv2.0.50727CONFIGBrowsersopera.browser is not installed on the system

    [09/10/09,16:17:25] ****ERROR**** File C:WindowsMicrosoft.NETFrameworkv2.0.50727CONFIGBrowserspalm.browser is not installed on the system

    [09/10/09,16:17:25] ****ERROR**** File C:WindowsMicrosoft.NETFrameworkv2.0.50727CONFIGBrowserspanasonic.browser is not installed on the system

    [09/10/09,16:17:25] ****ERROR**** File C:WindowsMicrosoft.NETFrameworkv2.0.50727CONFIGBrowserspie.browser is not installed on the system

    [09/10/09,16:17:25] ****ERROR**** File C:WindowsMicrosoft.NETFrameworkv2.0.50727CONFIGBrowserswebtv.browser is not installed on the system

    [09/10/09,16:17:25] ****ERROR**** File C:WindowsMicrosoft.NETFrameworkv2.0.50727CONFIGBrowserswinwap.browser is not installed on the system

    [09/10/09,16:17:25] ****ERROR**** File C:WindowsMicrosoft.NETFrameworkv2.0.50727CONFIGBrowsersxiino.browser is not installed on the system

    [09/10/09,16:17:25] ****ERROR**** File C:WindowsMicrosoft.NETFrameworkv2.0.50727CONFIGDefaultWsdlHelpGenerator.aspx is not installed on the system

    [09/10/09,16:17:25] ****ERROR**** File C:WindowsMicrosoft.NETFrameworkv2.0.50727CONFIGmachine.config is not installed on the system

    [09/10/09,16:17:25] ****ERROR**** File C:WindowsMicrosoft.NETFrameworkv2.0.50727CONFIGmachine.config.comments is not installed on the system

    [09/10/09,16:17:25] ****ERROR**** File C:WindowsMicrosoft.NETFrameworkv2.0.50727CONFIGmachine.config.default is not installed on the system

    [09/10/09,16:17:25] ****ERROR**** File C:WindowsMicrosoft.NETFrameworkv2.0.50727CONFIGweb.config is not installed on the system

    [09/10/09,16:17:25] ****ERROR**** File C:WindowsMicrosoft.NETFrameworkv2.0.50727CONFIGweb.config.comments is not installed on the system

    [09/10/09,16:17:25] ****ERROR**** File C:WindowsMicrosoft.NETFrameworkv2.0.50727CONFIGweb.config.default is not installed on the system

    [09/10/09,16:17:25] ****ERROR**** File C:WindowsMicrosoft.NETFrameworkv2.0.50727CONFIGweb_hightrust.config is not installed on the system

    [09/10/09,16:17:25] ****ERROR**** File C:WindowsMicrosoft.NETFrameworkv2.0.50727CONFIGweb_hightrust.config.default is not installed on the system

    [09/10/09,16:17:25] ****ERROR**** File C:WindowsMicrosoft.NETFrameworkv2.0.50727CONFIGweb_lowtrust.config is not installed on the system

    [09/10/09,16:17:25] ****ERROR**** File C:WindowsMicrosoft.NETFrameworkv2.0.50727CONFIGweb_lowtrust.config.default is not installed on the system

    [09/10/09,16:17:25] ****ERROR**** File C:WindowsMicrosoft.NETFrameworkv2.0.50727CONFIGweb_mediumtrust.config is not installed on the system

    [09/10/09,16:17:25] ****ERROR**** File C:WindowsMicrosoft.NETFrameworkv2.0.50727CONFIGweb_mediumtrust.config.default is not installed on the system

    [09/10/09,16:17:25] ****ERROR**** File C:WindowsMicrosoft.NETFrameworkv2.0.50727CONFIGweb_minimaltrust.config is not installed on the system

    [09/10/09,16:17:25] ****ERROR**** File C:WindowsMicrosoft.NETFrameworkv2.0.50727CONFIGweb_minimaltrust.config.default is not installed on the system

    [09/10/09,16:17:25] ****ERROR**** File C:WindowsMicrosoft.NETFrameworkv2.0.50727CORPerfMonExt.dll is not installed on the system

    [09/10/09,16:17:25] ****ERROR**** File C:WindowsMicrosoft.NETFrameworkv2.0.50727csc.exe is not installed on the system

    [09/10/09,16:17:25] ****ERROR**** File C:WindowsMicrosoft.NETFrameworkv2.0.50727csc.exe.config is not installed on the system

    [09/10/09,16:17:25] ****ERROR**** File C:WindowsMicrosoft.NETFrameworkv2.0.50727csc.rsp is not installed on the system

    [09/10/09,16:17:25] ****ERROR**** File C:WindowsMicrosoft.NETFrameworkv2.0.50727cscomp.dll is not installed on the system

    [09/10/09,16:17:25] ****ERROR**** File C:WindowsMicrosoft.NETFrameworkv2.0.50727cscompmgd.dll is not installed on the system

    [09/10/09,16:17:25] ****ERROR**** File C:WindowsMicrosoft.NETFrameworkv2.0.50727Culture.dll is not installed on the system

    [09/10/09,16:17:25] ****ERROR**** File C:WindowsMicrosoft.NETFrameworkv2.0.50727CustomMarshalers.dll is not installed on the system

    [09/10/09,16:17:25] ****ERROR**** File C:WindowsMicrosoft.NETFrameworkv2.0.50727cvtres.exe is not installed on the system

    [09/10/09,16:17:25] ****ERROR**** File C:WindowsMicrosoft.NETFrameworkv2.0.50727dfdll.dll is not installed on the system

    [09/10/09,16:17:25] ****ERROR**** File C:WindowsMicrosoft.NETFrameworkv2.0.50727dfsvc.exe is not installed on the system

    [09/10/09,16:17:25] ****ERROR**** File C:WindowsMicrosoft.NETFrameworkv2.0.50727diasymreader.dll is not installed on the system

    [09/10/09,16:17:25] ****ERROR**** File C:WindowsMicrosoft.NETFrameworkv2.0.50727dv_aspnetmmc.chm is not installed on the system

    [09/10/09,16:17:25] ****ERROR**** File C:WindowsMicrosoft.NETFrameworkv2.0.50727EventLogMessages.dll is not installed on the system

    [09/10/09,16:17:25] ****ERROR**** File C:WindowsMicrosoft.NETFrameworkv2.0.50727fusion.dll is not installed on the system

    [09/10/09,16:17:25] ****ERROR**** File C:WindowsMicrosoft.NETFrameworkv2.0.50727IEExec.exe is not installed on the system

    [09/10/09,16:17:25] ****ERROR**** File C:WindowsMicrosoft.NETFrameworkv2.0.50727ieexec.exe.config is not installed on the system

    [09/10/09,16:17:25] ****ERROR**** File C:WindowsMicrosoft.NETFrameworkv2.0.50727IEExecRemote.dll is not installed on the system

  84. Anonymous says:

    I have solved one issue that had erros like this –

    Product: Visual Studio .NET Enterprise Architect 2003 – English — Error 1937.An error occurred during the installation of assembly 'System.CF.Design,Version="7.0.5000.0",PublicKeyToken="b03f5f7f11d50a3a",Culture="neutral",FileVersion="7.10.3077.0"'. The signature or catalog could not be verified or is not valid. HRESULT: 0x80131045. assembly interface: IAssemblyCacheItem, function: Commit

    After going through this site and many other sites, I came up with this.

    Run gacutil.exe /i "System.CF.Design.dll" (Or whatever Assembly you are facing a problem with). you will find these DLL's under the Program FilesMicrosoft Visual Studio .NET 2003 , in that path, there are multiple directories below search everywhere and you will find your target.

    Once you run the above command, you should see a result like this –

    Microsoft (R) .NET Global Assembly Cache Utility.  Version 1.1.4322.573

    Copyright (C) Microsoft Corporation 1998-2002. All rights reserved.

    Assembly successfully added to the cache

    Go confirm if this assembly can be seen in Control Panel, Administrative Tools, Microsoft .NET Framework <1.1> Configuration and choose Assembly Cache. If you can see it there, then you can go to the next step.

    Run from the same location Microsoft .NET Framework 1.1 Wizards and choose "Trust an Assembly", then choose your assembly DLL and trust for the computer.

    Rerun your setup. It worked for me, hope it works for you.

    Thanks.

  85. Anonymous says:

    hi.

    wen am tried to install the new nokia ovi suite, i get same 1935 error msg like below

    Error 1935.An error occured during the installation of the assembly component {303994BA 6487 47AC AF1D-7AF60088EEBDB}. HRESULT:0x80073712

    plz help me resolving this…….

  86. Hi Rifae – Which version of Windows are you running when you see this error?  If it is Windows Vista or later, then I'd suggest trying out the System Update Readiness Tool because the 0x80073712 error code is listed in the knowledge base article for that tool.  You can find a link to that tool and some information about how I have used that tool in the past at blogs.msdn.com/…/9303167.aspx.

  87. Anonymous says:

    I get an Error 1935 …….component {763CF0F6-9B9D-35DA-81C6-CA8A88CC93CA}. HRESULT: 0x800736FD

    Trying to install quicken 2010 on win7 home premium.  ASUS netbook. Had same problem on HP system with CoreI7 and 8Gb ram & win7HomePremium.  On the HP I think I fixed it by changing permissions on Documents and Settings so the installer could write to it.  Always running as Administrator.  Can't change permission on my netbook.

    Any suggestions?  Thanks.

  88. Hi Meodegard – I'd suggest trying the System Update Readiness Tool and the steps listed at the end of the blog post at blogs.msdn.com/…/9303167.aspx to see if that helps in this scenario.

    If that doesn't help, then I'd suggest one of the following:

    1.  Contact Microsoft technical support for further troubleshooting assistance.  You can find contact information at http://support.microsoft.com

    2.  Repair/re-install Windows on your computer

  89. Anonymous says:

    Great! It helped to me too!

    Thank you very much!

  90. Anonymous says:

    hI

    Delete installation files and update the program requested openofficeorg30.msi which I removed, then I completely deleted the program and tried to put the new version but the program generated an error installing Internal Error 2908. {39E14F50-85DE-94D2-22F2-86BA88EF8B3E}

    Internal Error 2908. {D7DEBF5E-4F04-3BF6-449C-EAF92D27D59C}

    Internal Error 2908. {2BEACBB3-D599-1204-AA71-B442E0BF954A}

    Internal Error 2908. {B5719958-B85F-CA4F-015E-F633B68AE693}

    Internal Error 2908. {5E6C4891-3904-C405-7A09-F0263EC3E674}

    1935.Oshibka error when installing the assembly "policy.1.0.cli_ure, publicKeyToken =" ce2cb7e279207b9e ", version =" 14.0.0.0 ", culture =" neutral ", processorArchitecture =" MSIL "". For more information, contact the Help and Support Center. HRESULT: 0x8007007E. assembly interface:, function: CreateAssemblyNameObject, component: {728A788B-2689-AE5F-DA00-B24B26FC84E4}

  91. Hi Snepper – Error code 0x8007007E means "The specified module could not be found."  That usually indicates some kind of problem with the installer that you're trying to run as opposed to a problem with the .NET Framework.  I'd suggest trying to re-download and re-run the installer to see if that helps.  If not, then I'd suggest contacting the manufacturer of this installer to see if they have any known issues and/or suggested workarounds for this error.

  92. Anonymous says:

    This is what the other error looks like:

    Error 1935. An error occurred during the installation of assembly component

    {359E644D-5858-41D1-8817-8077CF366A54}. HRESULT: 0x8002802F.

    Tnx

  93. Hi Randy – Return code 0x8002802F means "function not defined in specified DLL" and it usually means that there is something wrong with the file mscoree.dll on your computer.  What version of Windows are you using on the computer where you see this, and what product are you installing?

  94. Anonymous says:

    Im using windows 7. Im installing microsoft office 2010. It happens during the middle of the installation. Also, im getting the error 2908 before 1935. The 2908 has three options whether to abort, retry or ignore.

  95. Hi Randy – On Windows 7, I'd suggest trying to use the steps listed at blogs.msdn.com/…/how-to-repair-the-net-framework-2-0-and-3-0-on-windows-vista.aspx to repair the files that are a part of Windows.  I'd also suggest double-checking that you have all of the .NET Framework 2.0 registry keys that are listed at blogs.msdn.com/…/3260076.aspx.

    If neither of those help, then it might also help to try to install the .NET Framework 4 before installing Microsoft Office 2010.

    If none of the above help, then you may need to repair/re-install Windows to solve this issue.

  96. Anonymous says:

    Still not working. is there any other way of solving this without reinstalling windows. i had deleted the microsoft starter edition first before installing ms 2010 using the control panel. can that be the cause why i cant install ms 2010?

  97. Hi Randy – Can you run the .NET Framework setup verification tool that is described at blogs.msdn.com/…/8999004.aspx and let me know if it reports any errors on your computer?  If it does, please upload the log file to a file server (such as http://skydrive.live.com) and reply back here with a link that I can use to download the log file and take a further look.

    Also, it might help to try the System Update Readiness Tool for this type of issue.  You can find it at support.microsoft.com/…/947821.

  98. Anonymous says:

    Sorry i dpn't know how to use windows live. but i've uploaded it to mediafire. is it ok?

    http://www.mediafire.com

    im currently downloading the System Update Readiness Tool for Windows 7. is that the one you were talking about? the 100+mb

  99. Anonymous says:

    The system update tool did not work:(

  100. Hi Randy – According to your verification log file, you are running into the same issue that I described at blogs.msdn.com/…/10110053.aspx.  Unfortunately, if the System Update Readiness Tool didn't help solve this issue, then the only other way I know of to solve this is to repair/re-install Windows.

  101. Anonymous says:

    last questions. is reinstalling windows a guaranteed way of solving my problem? will the problem not repeat?

  102. Hi Randy – Yes, re-installing Windows will fix this error.  I don't know for sure what the cause of the error is, so unfortunately I can't guarantee it won't return at some point in the future.

  103. Anonymous says:

    I have been trying to install visual c++ 2008 Distributables on my computer no and an error message pops up,

    Error 1935.An error occurred during the installation of assembly 'Microsoft.VC90.ATL,version="9.0.30729.4148", publicKeyToken="1fc8b3b9a1e18e3b",processorArchitecture="x8",type="win32" Please refer to Help and Support for more information. HRESULT:0x800736B3.

    Would any of you shed some light on this?

    Kind regards

    taro

  104. Hi Taromiya – I'm guessing you're using Windows Vista or Windows 7 when you see this.  If so, then the HRESULT value 0x800736b3 usually means that there is something wrong with a part of Windows, and I'd suggest trying to use the System Update Readiness Tool and the steps listed at blogs.msdn.com/…/9303167.aspx to try to solve this issue.

    If that doesn't help, you may need to repair/re-install Windows to solve this type of problem.

  105. Anonymous says:

    Error 1935 – An error occurred during installation assembly

    component (74FD3CE6-2A8D-OEGC-A01F-C88389A1E18E)

    HRESULT: 0x800736FD.

    could you please help me?

  106. Hi Fesal – This HRESULT most likely means that there is something wrong with Windows.  I'd suggest the following to see if they help solve this type of error:

    1.  Install the latest service pack for the version of Windows that you have on your computer.
    2.  Use the System Update Readiness Tool and the steps listed at blogs.msdn.com/…/9303167.aspx to repair your Windows component store.

    3.  Use the steps listed at blogs.msdn.com/…/how-to-repair-the-net-framework-2-0-and-3-0-on-windows-vista.aspx to repair the files that are a part of Windows.

    If none of the above help, then you will likely need to repair/re-install Windows to solve this type of error.

  107. Anonymous says:

    I'll need Help i can't install the vcredist_x86 2005 and 2008 here is the log file

    skydrive.live.com

    I've tryied all

  108. Hi Ozkarleo – The log you uploaded shows the following error:

    Error 1935.Error al instalar el ensamblado "Microsoft.VC80.MFC,type="win32",version="8.0.50727.4053",publicKeyToken="1fc8b3b9a1e18e3b",processorArchitecture="x86"". Consulte Ayuda y soporte técnico para obtener más información. HRESULT: 0x80073712. Interfaz de ensamblado: IAssemblyCacheItem, función: Commit, componente {9BAE13A2-E7AF-D6C3-A01F-C8B3B9A1E18E}

    The HRESULT value 0x80073712 means ERROR_SXS_COMPONENT_STORE_CORRUPT, and it is one of the error codes listed at support.microsoft.com/…/947821.  I'd suggest trying the System Update Readiness Tool described in that knowledge base article to see if it can help solve this error.

    If that doesn't help, I don't know of any suggestions for you to try other than to repair/re-install Windows.

  109. Error 1935.An error occurred during the installation of assembly component {303994BA-6487-47AE-AF1D-7AF6088EEBDB}. HRESULT: 0x800700B7. assembly interface: IAssemblyCacheItem, function: Commit, assembly name: Microsoft.MSXML2,publicKeyToken="6bd6b9abf345378f",type="win32",version="4.20.9818.0",processorArchitecture="x86"

    Please help

    John

  110. Hi Janoweil – The MSXML2 assembly is a Win32 assembly, and 1935 errors for Win32 assemblies are not caused by the .NET Framework.  If you're running Windows Vista or later, then I'd suggest looking at the information at blogs.msdn.com/…/9904471.aspx for troubleshooting ideas.

  111. Anonymous says:

    Hello,

    i have been looking for this. i also faced this problem many times but after reading this article i fixed it. Thanks for sharing this post. i also got some help from this article <a href="ezinearticles.com 1935 windows 7</a> , hope someone might get help from this article.

  112. Hi Error 1935 Windows 7 – I took a look at the article that you posted a link to, and I'm not sure I agree with some of the suggestions listed there.  In my experience, these are the most common causes of 1935 errors on Windows 7, so I'd suggest that folks who run into this problem look at these posts:

    blogs.msdn.com/…/10110053.aspx

    blogs.msdn.com/…/9904471.aspx

  113. Anonymous says:

    Hi,

    I'm getting this error while trying to install Office 2010 Suite Plus on my Vista.  After a couple of days of trying to uninstall all previous Office Suite versions, all .Net Framework versions and just reinstalled .Net Framework 4. and still get same error message.  Please help.  Below is a complete error message

    Microsoft Office Professional Plus 2010 encountered error during setup.

    Error 1935. An error occurred during the installation of assembly component

    {AFA31654-361E-33B5-9ED5-049A6889325C}. HRESULT: 0x8007054F

    Thanks,

    Calvin

  114. Hi Calvin – I deleted the cbs.log file that you posted in your follow-up comment because it was too large.  In the future, please upload log files like that to a file server (such as http://skydrive.live.com) and post a link as a comment so I can download it separately.

    I think this is the issue in the log file that is causing the failure:

    2011-11-30 08:58:08, Info                  CSI    00000006 Pending transaction content must be resolved, cannot begin another transaction yet

    If you do a web search for this error, there are several possible causes and different ideas for how to work around it.  Here are a few links I found that might be helpful to you:

    support.microsoft.com/…/968440

    social.technet.microsoft.com/…/92be1b34-23cd-46b0-bf21-106d0a5e2e38

    blogs.technet.com/…/installation-failures-cbs-store-corruptions-uncommon-issues-and-troubleshooting.aspx

  115. Anonymous says:

    I am trying to follow up your steps but unfortunately I can not renamed mscoree.dll! It is protected. Please help.

  116. Hi Sandra_CMVG – This troubleshooting guide was created before the .NET Framework 2.0 started shipping as a part of the OS on Windows Vista and Windows 7.  Starting in those versions of Windows, it is not possible to rename mscoree.dll like that, and in my past experience it is also not necessary to do so.

    What is the exact error message that you're seeing in your scenario?  I can post some links to additional troubleshooting steps for you to try, but the steps you'll need to try depend on what the exact HRESULT is on your computer.

  117. Anonymous says:

    Error 1935 appeared due .Net framework but i fixed it after taking help from this post. Thanks for sharing this. I also got some help from this site; http://www.error-1935.com/  Hope it helps you also.

  118. Anonymous says:

    im using windows 7 with 32 bit operating system….im installing SPSS 17 and then an error occurred  "Error 1935.An error occured during the installation of assembly componetn {9BAE13A2-E7AF-D6C3-A01F-C8B3B9A1E18E}.HRESULT: 0x800736CC"..

    Dude how i be able to solve this issue…thanks to anyone who can help me….. appreciated it all

  119. Hi Gohdoi – Error code 0x800736CC means ERROR_SXS_FILE_HASH_MISMATCH, and that typically means that there is something wrong with the Windows components on your computer.  Here are the things I usually suggest that people try when they encounter this type of error:

    1.  Try to install the latest Windows service pack if you haven't already.
    2.  Try to run the System Update Readiness Tool from support.microsoft.com/…/947821.

    3.  Try to repair the files that are a part of Windows by using the steps listed at blogs.msdn.com/…/how-to-repair-the-net-framework-2-0-and-3-0-on-windows-vista.aspx.

    If none of the above help, then you may need to repair/re-install Windows to resolve this issue.

  120. Anonymous says:

    Hi Aaron,

    I also have the 1935 err code problem. I made an installer (using InnoSetup tool) that prior the installation of the main app, it installs some prerequisites (in case they're not already installed): Windows Imaging Component, Windows Installer 4.5, .NET Framework 2.0 SP2, .NET 4.0, SQL Server Express 2005 SP2. Every dependency is installed in silent mode.

    The installer is run under Windows 7 32bit inside a virtual machine (Virtual Box)

    The err code 1935 appears when trying to install the last dependency SQL Server Express 2005 SP2.

    Specific message is:

    Product: Microsoft SQL Server Setup Support Files (English) — Error 1935. An error occurred during the installation of assembly 'Microsoft.SqlServer.WizardFrameworkLite,Version="9.0.242.0",processorArchitecture="MSIL",Culture="neutral",PublicKeyToken="89845dcd8080cc91",FileVersion="9.0.3042.0"'. Please refer to Help and Support for more information. HRESULT: 0x8002802F. assembly interface: , function: CreateAssemblyNameObject, component: {52723CBD-3400-458C-988A-4D012E6CAEDB}Product: Microsoft SQL Server Setup Support Files (English) — Error 1935. An error occurred during the installation of assembly 'Microsoft.SqlServer.WizardFrameworkLite,Version="9.0.242.0",processorArchitecture="MSIL",Culture="neutral",PublicKeyToken="89845dcd8080cc91",FileVersion="9.0.3042.0"'. Please refer to Help and Support for more information. HRESULT: 0x8002802F. assembly interface: , function: CreateAssemblyNameObject, component: {52723CBD-3400-458C-988A-4D012E6CAEDB}

    ===========================

    Product: Microsoft SQL Server Setup Support Files (English) — Error 2908. The installer has encountered an unexpected error. The error code is 2908. Could not register component {1F3316BE-825B-4390-A9D2-AF3EECCAE9F6}.

    Any idea?

  121. Hi Liviu – The HRESULT value that you're getting (0x8002802F) means that there is something wrong with the file %windir%system32mscoree.dll on your computer.  Most commonly, it means that the version of mscoree.dll is older than the version of the .NET Framework that you're trying to use.  On Windows 7, the most common cause I've seen for that type of error is the one I described at blogs.msdn.com/…/10110053.aspx.  I'd suggest taking a look at that post to see if the information there helps at all in your scenario.

    It might also be possible that your installer is suppressing a reboot after .NET Framework installation when it shouldn't be.  If you get exit code 3010 when installing the .NET Framework, you need to make sure that your installer reboots before you run later installers that require the .NET Framework.

  122. Anonymous says:

    I'm using Windows Vista and trying to install .NET V1.1.4322 and I keep getting Internal Error 2908 {7D4B5591-4C80-42BB-BOE5-F2C0CEE02C1A} and several other 2908 codes. Do you have any ideas about what I should do?

  123. Hi Random Comments – Can you please use the steps listed at blogs.msdn.com/…/help-me-help-you-if-you-have-setup-bugs.aspx to get a verbose log file from the failing .NET Framework 1.1 setup on your computer, zip and upload the log file to a file server (such as http://skydrive.live.com), and then reply back here and provide a link that I can use to download your log file and take a closer look?

  124. Anonymous says:

    Hi Aaron,

    on Windows 2008 R2, I get this error:

    Fehler 1935. Während der Installation von Assemblykomponente "{4F6D20F0-CCE5-1492-A01F-C8B3B9A1E18E}" ist ein Fehler aufgetreten. HRESULT: 0x800736FD.

    I tried to reinstall VC 2005 runtime, also I tried MSIZAP g! but nothing helped.

    Any ideas how to solve this issue?

    Walter

  125. Hi WalterHofstaedtler – On Windows Vista and later, error code 0x800736FD means that there is something wrong with the Windows OS installation engine (because it is used behind the scenes to install the VC++ runtime files and other Win32 assemblies on those versions of Windows).  Here are the steps that I suggest for this type of error:

    1.  Install the latest Windows service pack if you haven't yet.
    2.  Try to run the System Update Readiness Tool from support.microsoft.com/…/947821.

    3.  Try to repair the files that are a part of your OS by using the steps listed at blogs.msdn.com/…/how-to-repair-the-net-framework-2-0-and-3-0-on-windows-vista.aspx.

    If none of the above help, you might need to repair/re-install Windows to fix this type of error.

  126. Anonymous says:

    Hi Aaron,

    this sounds worse, I already run the System Update Readiness Tool without errors, also sfc /scannow did not find any errors. SP1 for Windows 2008 R2 is already installed. Also all Patches up to today are installed.  

    Any additional ideas to solve this issue?

    Walter

  127. Hi walter@hofstaedtler.com – I'd suggest doing a web search for the error code 0x800736FD.  There are some forum posts from people who have had that type of issue that include other suggestions that you might want to try before you resort to re-installing Windows.

  128. Anonymous says:

    I m also having the same problem like NKirankumar. "Error 1935. An error occurred during the installation of assembly 'DotNetCasClient,version="1.0.0.0",culture="neutral",publicKeyToken="4F9624BA9F070CCD",processorArchitecture="MSIL"'. Please refer to Help and Support for more information. HRESULT: 0x80131043. assembly interface: IAssemblyCacheItem, function: Commit, component: {F28FEBF7-F3B6-46AB-B194-8054C26EDC7D}".

    I am trying to intsall one dll file only, and it doesn't have any extra files. Still i m getting the same error. I m trying to add module in applicationhost using appcmde.exe. in msi using WIX.

  129. Hi Murali – Usually, this type of error means that you've inadvertantly included multiple files in the Windows Installer component that is being used to install this assembly.  I'd suggest double-checking the component ID value that you're using for this component in your WiX files to make sure that you haven't duplicated that ID value for another component, and I'd suggest looking at your MSI in Orca.exe to double-check that there aren't multiple files included in the component.

  130. Anonymous says:

    Hi.

    I am having problem while installing the software called COMMON VISON BLOX while installing it give me an error stating that "Error 1935 an error occured during the installation of Assembly Compenent  8731EA9c-B0D8-8F16-A0-1F-C883B9A1E18E  HRresult  0x80073683.

    Plz help me out how to solve this problem.

  131. Hi Tarun Patel – I don't recognize the HRESULT value that you listed in your comment.  If this is happening on Windows Vista or later versions of Windows, then here are the steps that I usually suggest that someone try to resolve this type of error:

    1.  Install the latest Windows service pack if you haven't yet.
    2.  Try to run the System Update Readiness Tool from support.microsoft.com/…/947821.

    3.  Try to repair the files that are a part of your OS by using the steps listed at blogs.msdn.com/…/how-to-repair-the-net-framework-2-0-and-3-0-on-windows-vista.aspx.

    If none of the above help, you might need to repair/re-install Windows to fix this type of error.  It might also help to post a question on one of the Windows forums to see if someone there has any additional suggestions for you to try before you resort to re-installing Windows.

  132. Anonymous says:

    Hi, I also encounter this problem, but Regmender.com helps me fix the error too…visit for more: http://www.regmender.com/how-to-fix-error-1935.html

    Hope this information is helpful.

  133. Anonymous says:

    Hi AAron,

    The earlier post had some mistake in HRresult.

    I am having problem while installing the software called COMMON VISON BLOX while installing it give me an error stating that "Error 1935 an error occured during the installation of Assembly Compenent  8731EA9c-B0D8-8F16-A0-1F-C883B9A1E18E  HRresult  0x800736B3.

    I run full scan of .netframework to verify my installation all is working well.

    I also used System Update Readiness Tool and it works perfectly.

    I don't want to format my system because i have several server license on my system for robots and others.

    Plz help me out how to solve this problem.

    eagerly waiting for your reply.

  134. Hi Tarun Patel – On Windows Vista and later, error code 0x800736B3 means that there is something wrong with the Windows OS installation engine (because it is used behind the scenes to install some types of assemblies on those versions of Windows).  Here are the steps that I suggest for this type of error:

    1.  Install the latest Windows service pack if you haven't yet.

    2.  Try to run the System Update Readiness Tool from support.microsoft.com/…/947821.

    3.  Try to repair the files that are a part of your OS by using the steps listed at blogs.msdn.com/…/how-to-repair-the-net-framework-2-0-and-3-0-on-windows-vista.aspx.

    If none of the above help, you might need to repair/re-install Windows to fix this type of error.  It might also help to post a question on one of the Windows forums to see if someone there has any additional suggestions for you to try before you resort to re-installing Windows.

  135. Anonymous says:

    Hi Aaron, We are getting following error while upgrading ImageNow Desktop Client on windows 7 Pro 64 bit

    Error logged in MSI logs :- MSI (s) (10:EC) [12:55:32:914]: Assembly Error (sxs): Please look into Component Based Servicing Log located at -131730312ndirlogscbscbs.log to get more diagnostic information.

    Error 1935.An error occurred during the installation of assembly component {63E949F6-03BC-5C40-A01F-C8B3B9A1E18E}. HRESULT: 0x800736FD. assembly interface: IAssemblyCacheItem, function: Commit, assembly name: policy.8.0.Microsoft.VC80.CRT,publicKeyToken="1fc8b3b9a1e18e3b",version="8.0.50727.6195",type="win32-policy",processorArchitecture="x86"

    MSI (s) (10:EC) [12:56:06:347]: Product: ImageNow Desktop Client — Error 1935.An error occurred during the installation of assembly component {63E949F6-03BC-5C40-A01F-C8B3B9A1E18E}. HRESULT: 0x800736FD. assembly interface: IAssemblyCacheItem, function: Commit, assembly name: policy.8.0.Microsoft.VC80.CRT,publicKeyToken="1fc8b3b9a1e18e3b",version="8.0.50727.6195",type="win32-policy",processorArchitecture="x86"

  136. Anonymous says:

    MSI (s) (10:EC) [12:55:32:914]: Assembly Error (sxs): Please look into Component Based Servicing Log located at -131730312ndirlogscbscbs.log to get more diagnostic information.

    Error 1935.An error occurred during the installation of assembly component {63E949F6-03BC-5C40-A01F-C8B3B9A1E18E}. HRESULT: 0x800736FD. assembly interface: IAssemblyCacheItem, function: Commit, assembly name: policy.8.0.Microsoft.VC80.CRT,publicKeyToken="1fc8b3b9a1e18e3b",version="8.0.50727.6195",type="win32-policy",processorArchitecture="x86"

    MSI (s) (10:EC) [12:56:06:347]: Product: ImageNow Desktop Client — Error 1935.An error occurred during the installation of assembly component {63E949F6-03BC-5C40-A01F-C8B3B9A1E18E}. HRESULT: 0x800736FD. assembly interface: IAssemblyCacheItem, function: Commit, assembly name: policy.8.0.Microsoft.VC80.CRT,publicKeyToken="1fc8b3b9a1e18e3b",version="8.0.50727.6195",type="win32-policy",processorArchitecture="x86"


    Any Suggestion ? This is on Win 7 64bit PC

  137. Hi Pankaj Jadhav – On Windows Vista and later, error codes that start with 0x800736 (including the 0x800736FD in your log) mean that there is something wrong with the Windows OS installation engine (because it is used behind the scenes to install the Visual C++ runtime files and some other types of assemblies on those versions of Windows).  Here are the steps that I suggest for this type of error:

    1.  Install the latest Windows service pack if you haven't yet.
    2.  Try to run the System Update Readiness Tool from support.microsoft.com/…/947821.

    3.  Try to repair the files that are a part of your OS by using the steps listed at blogs.msdn.com/…/how-to-repair-the-net-framework-2-0-and-3-0-on-windows-vista.aspx.

    If none of the above help, you might need to repair/re-install Windows to fix this type of error.  It might also help to post a question on one of the Windows forums to see if someone there has any additional suggestions for you to try before you resort to re-installing Windows.

  138. Anonymous says:

    Hi Aaron, could you help me?~~please

    error 1935.an error occurred during the installation of assembly 'Microsoft.VC90.ALT,version="9.0.30729.6161",publicKeyToken="1fc8b3b9a1e18e3b",processorArchitecture="x86",type="win32".please refer to help and support for more information.HRESULT:0x80070BC9.assembly interface:IAssemblyCacheItem,function:Commit,compoent:(03329364-ED3E-3EF1-ACB0-C1E9F5282929)

  139. Hi William – What version of Windows are you running?  If it is Windows Vista or later, here are the steps that I suggest for this type of error:

    1.  Install the latest Windows service pack if you haven't yet.
    2.  Try to run the System Update Readiness Tool from support.microsoft.com/…/947821.

    3.  Try to repair the files that are a part of your OS by using the steps listed at blogs.msdn.com/…/how-to-repair-the-net-framework-2-0-and-3-0-on-windows-vista.aspx.

    If none of the above help, you might need to repair/re-install Windows to fix this type of error.  It might also help to post a question on one of the Windows forums to see if someone there has any additional suggestions for you to try before you resort to re-installing Windows.

  140. Anonymous says:

    Hi Aron! I do have a brand new desktop with Windows 8 installed. Everything works as a charm… I installed various programs w/o any problem. Recently I tried to instal Adobe Lightroom 4.3 and then 4.4 version. Everytime I get the installation freezing right after I press Install button. If I use "Diagnostic startup" the installation begins but stops after about 75% of the files are copied. The error is, as you may guess: 1935. I have here a screenshot with the complete message:

    http://www.graphy.ro/…/2013-04-01_145212.png

    Can you give me any suggestion please? I posted a question in the Win 8 forum from Microsoft but w/o to receive a solution that works. I tried to turn off the NET frameworks that are installed (3.5 and 4.5) but doesn't work. I tried to reinstall them but I get a message saying that are already installed. What can I do?

  141. Hi Mihai C – Most 1935 errors on Windows Vista and later are not caused by the .NET Framework.  In this particular case, I'd first suggest trying the steps at support.microsoft.com/…/958043 to see if they help.

    If those steps don't help, then I'd suggest the following:

    1.  Try to run the System Update Readiness Tool from support.microsoft.com/…/947821.
    2.  Try to repair the files that are a part of your OS by using the steps listed at blogs.msdn.com/…/how-to-repair-the-net-framework-2-0-and-3-0-on-windows-vista.aspx.

    If none of the above help, you might need to repair/re-install Windows to fix this type of error.

  142. Anonymous says:

    I just wanted to add that you can get this error 1935 if you having Windows updates that are pending on a restart.  When I restarted and tried again, no errors.  This was on Windows 7 SP1.

  143. Anonymous says:

    Hi I am trying to install Adobe Lightroom 5.2 (64bit) on my windows 7 PC.

    But I am getting the same error message over and over again:

    Error 1935: An error occured during the installation of assembly component

    {6435B7C0-E0C8-3EA2-91AE-7640034AEAFCE}

    HRESULT: 0x80071A91

    Can you help me resolve this?

    Thanks!

    Abhishek

  144. Hi Abhishek – I'd suggest trying the workarounds listed in the forum post at social.technet.microsoft.com/…/error-0x80071a91 and see if they help in this scenario.

  145. Anonymous says:

    Im trying to install office 2007 home but i experience fthe following problem.Help me please.         Assembly component {98CB24AD-52FB-DB5F-A01F-C8B3B9A1E18E} – hresult – error0x80070308

  146. Hi nythil – Here are the steps that I suggest for this type of error:

    1.  Install the latest Windows service pack if you haven't yet.
    2.  Try to run the System Update Readiness Tool from support.microsoft.com/…/947821.

    3.  Try to repair the files that are a part of your OS by using the steps listed at blogs.msdn.com/…/how-to-repair-the-net-framework-2-0-and-3-0-on-windows-vista.aspx.

    If none of the above help, you might need to repair/re-install Windows to fix this type of error.  It might also help to post a question on one of the Windows forums to see if someone there has any additional suggestions for you to try before you resort to re-installing Windows.

  147. Anonymous says:

    I need help.

    I have the error code 2908. HRESULT 0x8002802F

    I know you need to rename or delete i don't know but you need to do something with mscoree.dll.

    I have a little problem, i don't know why it says i don't have permissions and im the owner of the computer (IT'S MY COMPUTER) Q-Q

    I used that program that is 'TakeOwnership' and it didn't work. I need help please help me! 🙁

  148. Hi Max – What version of Windows are you running on your computer?  If you are running one of the versions supported by the .NET Framework 4.5.1, I'd suggest trying to install that to see if it helps resolve this issue.  You can download the .NET Framework 4.5.1 from http://www.microsoft.com/…/details.aspx.

    If that doesn't help, then the information at blogs.msdn.com/…/3260076.aspx might help too.

  149. Anonymous says:

    I need Help.

    I tried to insatll Microsoft Report Viewer Redistributable 2008 & setup encounter an error.

    OS- Windows 2008 R2 Std.

    Product: Microsoft Report Viewer Redistributable 2008 — Error 1935.An error occurred during the installation of as-sembly 'Microsoft.ReportViewer.Common,version="9.0.0.0",publicKeyToken="b03f5f7f11d50a3a",processorArchitecture="MSIL",fileVersion="9.0.21022.8",culture="neutral"'. Please refer to Help and Support for more information. HRESULT: 0x8002802F. assembly interface: , function: CreateAssemblyCache, component: {EBD30479-E521-4F10-AA2A-5A0B2ED25F1E}

    Product: Microsoft Report Viewer Redistributable 2008 — The installer has encountered an unexpected error installing this package. This may indicate a problem with this package. The error code is 2908. The arguments are: {EBD30479-E521-4F10-AA2A-5A0B2ED25F1E}, ,

  150. Hi Thethi – There is some information about the 0x8002802F error code in the blog post at blogs.msdn.com/…/3260076.aspx that might help you in this situation.

  151. Anonymous says:

    Hi. I need help.

    I tried to install autocad 2012 on my 32bit win7.

    there was problem.

    Microsoft Visual C++ 2005 redistributable failed. i think it was prerequisite

    And it,s log file:

    Error 1935.An error occurred during the installation of assembly 'Microsoft.VC80.OpenMP,type="win32",version="8.0.50727.42",publicKeyToken="1fc8b3b9a1e18e3b",processorArchitecture="x86"'. Please refer to Help and Support for more information. HRESULT: 0x800736FD. assembly interface: IAssemblyCacheItem, function: Commit, component: {1E507087-0819-45E0-A01F-C8B3B9A1E18E}

    === Logging stopped: 14.04.24  8:09:46 ===

    can you help me? please ?

  152. Hi Beku – Error code 0x800736FD indicates a problem with the Windows OS component store on your computer.  Here are the steps that I typically recommend trying to resolve that type of error:

    1.  Install the latest Windows service pack if you haven't yet.
    2.  Try to run the System Update Readiness Tool from support.microsoft.com/…/947821.

    3.  Try to repair the files that are a part of your OS by using the steps listed at blogs.msdn.com/…/how-to-repair-the-net-framework-2-0-and-3-0-on-windows-vista.aspx.

    If none of the above help, you might need to repair/re-install Windows to fix this type of error.  It might also help to post a question on one of the Windows forums to see if someone there has any additional suggestions for you to try before you resort to re-installing Windows.

  153. Anonymous says:

    hi, can please someone help me in this? i'm trying to install visual studio 2010 express, while installation my computer gets almost hanged when the installation reaches the point of installing vc 9.0 runtime (x86).

    i posted that question on several blogs and got different answers, someone said me to install microsoft visual c++ 2008 redistributable package (x64) and microsoft visual c++ 2008 redistributable package (x86) alone, i did this thing and while installing i get these errors.

    while installing (x86) i get this error:

    Error 1935. An error occurred during the installation of assembly 'Microsoft.VC90.ATL, version="9.0.21022.8", publicKeyToken="1fc8b3b9a1e18e3b", processorArchitecture="x86", type="win32"'.Please refer to Help and Support for more information. HRESULT: 0x800736FD.

    and while installing (x64) i'm getting this error:

    Error 1935. An error occurred during the installation of assembly 'Microsoft.VC90.ATL, version="9.0.21022.8", publicKeyToken="1fc8b3b9a1e18e3b", processorArchitecture="amd64", type="win32"'.Please refer to Help and Support for more information. HRESULT: 0x800736FD.

    please someone help me 🙁

  154. Hi haseeb qureshi – Error code 0x800736FD means that there is something wrong with the Windows OS installation engine (because it is used behind the scenes to install the VC++ runtime files and other Win32 assemblies on Windows Vista and newer versions of Windows).  Here are the steps that I suggest for this type of error:

    1.  Install the latest Windows service pack if you haven't yet.
    2.  Try to run the System Update Readiness Tool from support.microsoft.com/…/947821.

    3.  Try to repair the files that are a part of your OS by using the steps listed at blogs.msdn.com/…/how-to-repair-the-net-framework-2-0-and-3-0-on-windows-vista.aspx.

    If none of the above help, you might need to repair/re-install Windows to fix this type of error.  It might also help to post a question on one of the Windows forums to see if someone there has any additional suggestions for you to try before you resort to re-installing Windows.

  155. Anonymous says:

    HI IM TRAYING TO INSTALL LIGHTROOM, VERSIONS 4, 5 AND 5.6. NONE OF THOSE THREE WOULD WORK. IT ALWAYS APPEAR THE ERRO 1935. I HAVE WINDOWS 8.1. BOUGHT A NEW ASUS X550L FROM BEST BUY. AND I CAN DOWNLOAD LIGHTROOM, BUT THE INSTALLATION WOULDNT WORK. I NEED HELP. DONT KNOW ANYTHING ABOUT COMPUTER.

    THNX IN ADVANCE

  156. Hi Mariana – Here are the steps that I typically suggest to try to resolve 1935 errors on Windows Vista and all newer versions of Windows:

    1.  Install the latest Windows service pack and updates if you haven't yet.
    2.  Try to run the System Update Readiness Tool from support.microsoft.com/…/947821.

    3.  Try to repair the files that are a part of your OS by using the steps listed at blogs.msdn.com/…/how-to-repair-the-net-framework-2-0-and-3-0-on-windows-vista.aspx.

    If none of the above help, you might need to repair/re-install Windows to fix this type of error.  It might also help to post a question on one of the Windows forums to see if someone there has any additional suggestions for you to try before you resort to re-installing Windows.

  157. Anonymous says:

    I am getting following error message during installation of nokia pc suit. Installation fails and rolls back. Clearly it is Microsoft.VC90.ATL, version 9.0.30729.4148 that is failing to get installed. I have separately downloaded it and installed only to encounter same message. I have Windows 7. I do not see .net framework 2.0 [which you say shipped with W7] in 'Programs and features' where all the installed programs are listed. However I do see .net framework 4.0 extended and client profile 4.0.30319_X86 which I have separately installed. Microsoft .NET Framework NGEN v4.0.30319 service is unable to start either automatically or manually. Is it the cause or something else? Should I uninstall .net framework 4.0 and install 2.0 or merely uninstall and reinstall 4.0? Please help. I haven't touched anything yet.

    Product: Microsoft Visual C++ 2008 Redistributable – x86 9.0.30729.4148 — Error 1935.An error occurred during the installation of assembly 'Microsoft.VC90.ATL,version="9.0.30729.4148",publicKeyToken="1fc8b3b9a1e18e3b",processorArchitecture="x86",type="win32"'. Please refer to Help and Support for more information. HRESULT: 0x80070422. assembly interface: IAssemblyCacheItem, function: Commit, component: {A75F2217-AD54-3EA6-AE14-F255F8660531}

    I would appreciate your response soon. Thanks.

  158. Hi Vijay – On Windows Vista and later, Win32 assemblies are installed by a Windows service, and 1935 errors from Win32 assemblies are not related to the .NET Framework at all.  So, you don’t need to worry about uninstalling or re-installing the .NET Framework because it won’t help solve this issue.

    The error code 0x80070422 that you’re seeing means “ERROR_SERVICE_DISABLED – The service cannot be started, either because it is disabled or because it has no enabled devices associated with it.”

    I haven’t run into this exact error in my past experience, but I found this item on the forums that contains a suggested fix that will hopefully help in your scenario – answers.microsoft.com/…/08d8b4b0-ecb5-45f9-8028-b82f62794f7c.

    1. Tim says:

      Thanks, this helped! I typically disable the “Windows Module Installer” service (a.k.a. “Trusted Installer”) because it often takes up a lot of CPU and kicks up the fan speed trying to do… whatever it is that it does. So, enabled this service, and viola! Was able to keep moving past this error. Of course, once it’s installed, I’ll disable the service again.

  159. Anonymous says:

    Need Help ASAP!  Trying to install Office 2007 on a Dell 32 bit laptop w/a new Windows 7 Ultimate SP1 install by mid-day tomorrow (1/3/15)when my soldier son flies back to base from Christmas Break.  Keep getting error 1935 and install rollback.  Some inet research led me to look up Net Framework on computer which I found to be 4.5.1.  Do I need a different one or more Net Frameworks (whatever they are) to make this install work?

    Thanks, Pam

  160. Hi denpam1@juno.com – On Windows Vista and all newer versions of Windows, nearly all 1935 errors are caused by a problem with Windows and not a problem with the .NET Framework.  Here are the steps that I suggest for this type of error:

    1.  Install the latest Windows service pack and updates if you haven't yet.
    2.  Try to run the System Update Readiness Tool from support.microsoft.com/…/947821.

    3.  Try to repair the files that are a part of your OS by using the steps listed at blogs.msdn.com/…/how-to-repair-the-net-framework-2-0-and-3-0-on-windows-vista.aspx.

    If none of the above help, you might need to repair/re-install Windows to fix this type of error.  It might also help to post a question on one of the Windows forums to see if someone there has any additional suggestions for you to try before you resort to re-installing Windows.

  161. Anonymous says:

    HI, I WAS INSTALLING ASPEN HYSYS 8.0 WHEN I CAME THIS ERROR:

    Error 1935. An error ocurred during the installation of assembly component

    {66332652-9C28-58B1-A01F-C8B3B9A1E18E}. HRESULT: 0X80070BC9

  162. Hi ALVARO WILCHES – Hresult 0x80070bc9 means "The requested operation failed. A system reboot is required to roll back changes made."  I'd suggest trying to reboot your computer and trying to install again.  If that doesn't help, then I'd suggest these troubleshooting steps:

    1.  Install the latest Windows service pack and updates if you haven't yet.

    2.  Try to run the System Update Readiness Tool from support.microsoft.com/…/947821.

    3.  Try to repair the files that are a part of your OS by using the steps listed at blogs.msdn.com/…/how-to-repair-the-net-framework-2-0-and-3-0-on-windows-vista.aspx.

  163. Anonymous says:

    appl inst error "1935 0x8007054f"

    support.microsoft.com/…/2484025

    delete all files with .BLF and .REGTRANS-MS extension from "C:windowssystem32configTxR", reboot, afterwards the windows search svc may use high cpu usage as it rebuilds

  164. Hi pEtE – Here are the steps that I suggest for this type of error:

    1.  Install the latest Windows service pack and updates if you haven't yet.
    2.  Try to run the System Update Readiness Tool from support.microsoft.com/…/947821.

    3.  Try to repair the files that are a part of your OS by using the steps listed at blogs.msdn.com/…/how-to-repair-the-net-framework-2-0-and-3-0-on-windows-vista.aspx.

    If none of the above help, you might need to repair/re-install Windows to fix this type of error.  It might also help to post a question on one of the Windows forums to see if someone there has any additional suggestions for you to try before you resort to re-installing Windows.

  165. Anonymous says:

    hey plzzz help me , microsoft office enterprise 2007 encountered an error during setup . error 1935.An error occurred during the installation of assembly componennt (837BF1EB-D770-94EB-A01F-C8B3B9A1E18E) . HRESULT:00800736B3.

  166. Hi ahmed – That HRESULT value typically means that there is something wrong with the Windows component store on your PC, not the .NET Framework.  Here are the steps that I recommend for that type of error:

    1.  Install the latest Windows service pack and updates if you haven't yet.
    2.  Try to run the System Update Readiness Tool from support.microsoft.com/…/947821.

    3.  Try to repair the files that are a part of your OS by using the steps listed at blogs.msdn.com/…/how-to-repair-the-net-framework-2-0-and-3-0-on-windows-vista.aspx.

    If none of the above help, you might need to repair/re-install Windows to fix this type of error.  It might also help to post a question on one of the Windows forums to see if someone there has any additional suggestions for you to try before you resort to re-installing Windows.

  167. Anonymous says:

    an error occurred during the installation of assembly'microsoft.vc80.ATL,processArchiture="x86",publickeytoken="1fc8b3b9a1e18e3b",version="8.0.50727.762",type="win32".Please refer to help and suport for more information..please provide solution..

  168. Hi Sanjay – 1935 errors from Win32 assemblies (where type="win32" in the error message) mean that there is something wrong with the Windows component installer on your PC, not that there is something wrong with the .NET Framework.

    For 1935 errors from Win32 assemblies, here are the steps that I typically recommend to try to resolve the error:

    1.  Install the latest Windows service pack and updates if you haven't yet.

    2.  Try to run the System Update Readiness Tool from support.microsoft.com/…/947821.

    3.  Try to repair the files that are a part of your OS by using the steps listed at blogs.msdn.com/…/how-to-repair-the-net-framework-2-0-and-3-0-on-windows-vista.aspx.

    If none of the above help, you might need to repair/re-install Windows to fix this type of error.  It might also help to post a question on one of the Windows forums to see if someone there has any additional suggestions for you to try before you resort to re-installing Windows.

  169. juliocsa says:

    Hi Aaron Stebner,

    I tried to install RSLogix 5000 v17.00 (CPR 9 SR 1) in Windows XP Professional 2002 and an error message pops up:

    1- Error 2908. Could not register component {91E2A021-39E1-4054-8E73-42628357F0F4}.

    2- Error 1935. An error occured the installation of assembly component {11143163-E238-48F3-B9E1-9F6A6A2B58AF}. HRESULT: 0x8002802F.

    3- Internal Error 2908. {E815204F-616A-487B-9360-5CE5DBB243A5}

    4- Error 1935. An error occured during the installation of assembly

    'RockwellSoftware.FactoryTalk.Diagnostics.RaderCOM,Version="2.10.1.16",PublickeyToken="55624F8AC7C20AA6",Culture="neutral",FileVersion="2.10.1.16".

    Could you helpe me??

    Best regards.

    Julio Cesar

  170. Hi Juliocsa – You're getting a 1935 error with hresult 0x8002802F.  That means "function not defined in the specified DLL."  When that error happens on Windows XP, it tends to be caused by a problem with the version(s) of the .NET Framework that are installed on your PC.  I'd recommend using the tools and steps listed at blogs.msdn.com/…/8108332.aspx to manually remove all versions of the .NET Framework that are installed on your PC, then re-install the .NET Framework 3.5 SP1 from http://www.microsoft.com/…/details.aspx, then try again to install your application.

  171. juliocsa says:

    Thank you very much, mr. Aaron

  172. juliocsa says:

    Thank you very much, Mr Stebner

  173. vvv says:

    Hi. I'm trying to reinstall Bluetooth Suite in my computer.

    Here are the details:

    -Windows 7, Acer Aspire 5742G, all latest Updates installed, no viruses found by Avast

    -laptop began to turn off randomly around ~5 months ago. 2 weeks ago I sent the laptop for servicing, found out that one of the memory cards got busted (burned) which explains why the system shuts down without reason for more than 3 months.

    -after retrieving laptop, every Bluetooth-related stuff cannot be found (only Bluetooth File Transfer remained surprisingly)

    -took me a week to reinstall Bluetooth (and it happened by a fluke, cannot even determine how it happened in the first place)

    -Bluetooth components disapperead again (AGAIN!!!); just found out last Monday/Tuesday, and in the process of reinstalling (using the programs from Acer), got this message:

    Error 1935.An error occured during the installation of assembly component

    {844EFBA7-1C24-93B2-A01F-C8B3B9A1E18E}.

    HRESULT: 0x80070091

    Help…

  174. Hi vvv – HRESULT 0x80070091 means "The directory is not empty."  I haven't encountered that type of HRESULT with a 1935 error before, so I'm not sure what the cause is.  I did a web search, and some of the results suggested that it might be caused by overly aggressive anti-malware or anti-virus software, so it might help to temporarily disable anti-malware and anti-virus software during the installation of this application.

    It might also be possible to narrow down which directory is causing this problem by looking at a verbose MSI log file from the failing application install or by looking at %windir%logsCBScbs.log.

  175. Phani says:

    Error :Product: Tableau 9.1 (9100.15.1013.2200) — Error 1935. An error occured during the installation of assembly component {844EFBA7-1C24-93B2-A01F-C8B3B9A1E18E}. HRESULT: 0x80073715. assembly interface: IAssemblyCacheItem, function: Commit, assembly name: Microsoft.VC80.CRT,type="win32",version="8.0.50727.6195",publicKeyToken="1fc8b3b9a1e18e3b",processorArchitecture="amd64"

    Please help me on this

  176. Hi Phani – Error code 0x80073715 maps to ERROR_SXS_MANIFEST_IDENTITY_SAME_BUT_CONTENTS_DIFFERENT, and that means that there is something wrong with the Windows OS installation engine on your PC.  Here are the steps that I suggest for this type of error:

    1.  Install the latest Windows service pack and updates if you haven't yet.

    2.  Try to run the System Update Readiness Tool from support.microsoft.com/…/947821.

    3.  Try to repair the files that are a part of your OS by using the steps listed at blogs.msdn.com/…/how-to-repair-the-net-framework-2-0-and-3-0-on-windows-vista.aspx.

    If none of the above help, you might need to repair/re-install Windows to fix this type of error.  It might also help to post a question on one of the Windows forums at answers.microsoft.com/…/windows to see if someone there has any additional suggestions for you to try before you resort to re-installing Windows.